{"text_format":"1","workbook":"xlsx","n_sheets":19,"sheets":["Bienvenida","0.INTRUCCIONES de USO ","1.INDICE","2.PROYECTO","ANEXO INVERSIÓN","ANEXO FINANCIACIÓN","ANEXO INGRESOS","ANEXO GASTOS FIJOS","ANEXO GASTOS VARIABLES","ANEXO TESORERIA","3.INVERSION_FINANCIACION","4.INGRESOS","5.GASTOS FIJOS","6.GASTOS VARIABLES","7.CUENTA DE RESULTADOS ","8.IMPUESTOS ","9.PLAN TESORERIA","10. BALANCE","TABLAS REFERENCIA "],"not_rendered":{"charts":15,"images":7,"macros":1,"external_links":0,"defined_names":16,"comments":5,"pivot_tables":0},"unopened":[],"bounds":{"document_bytes":16777216,"sheet_cells":100000,"rows_first":2000,"rows_last":500,"rows_between":2000,"halvings":0,"cell_chars":16384,"cell_head_chars":4096},"cells_cut":0,"cells_raw":0,"read":"whole","date_system":"1900"}

{"sheet":"Bienvenida","index":0,"n_rows":23,"n_cols":2,"rows_kept":23,"cut":false,"hidden":false,"merged":[]}
[]
[]
[]
[]
[]
[]
[]
[null,"Esta herramienta se enmarca en el proyecto Barrios Productores"]
[]
[]
[]
[]
[]
[]
[]
[]
[]
[]
[]
[]
[]
[null,"Se ha desarrollado por Economistas sin Fronteras (EsF) y ha sido adaptada  "]
[null,"por EsF, Tangente y Heliconia para el Ayuntamiento de Madrid "]

{"sheet":"0.INTRUCCIONES de USO ","index":1,"n_rows":39,"n_cols":3,"rows_kept":39,"cut":false,"hidden":false,"merged":[[2,1,2,2],[19,1,19,2],[21,1,21,2],[25,1,25,2],[29,1,29,2],[6,1,6,2],[4,1,4,2],[12,1,12,2],[13,1,13,2],[16,1,16,2],[18,1,18,2],[36,1,36,2],[37,1,37,2],[38,1,38,2],[30,1,30,2],[34,1,34,2]]}
[null,"Ir al  índice"]
[]
[null,"INSTRUCCIONES BASICAS "]
[]
[1,"Al abrir la herramienta, será necesario tanto habilitar las macros como activar los cambios. Ambas opciones aparecen como \"warnings\" en la parter superior de la herramienta al abrir la hoja Excel. "]
[]
[2,"Para ejecutar muchos de los procedimientos de la herramienta , necesitamos configurar excel en modo \"programador\". Para ello , seguir los siguientes pasos antes de empezar a rellenar los formularios: "]
[null,"2.1","Seleccionar \"Archivo\", "]
[null,"2.2","Seleccionar \"Opciones\","]
[null,"2.3","En el menu de Opciones, seleccionar \" Personalizar cinta de opciones\","]
[null,"2.4","Activar las casillas \"Programador\" y \"Complementos\"."]
[]
[3," Se recomienda utilizar excel online o con la herramienta Excel local , no con herramientas libreoffice ni utilizarlo en google drive."]
[]
[]
[]
[null,"ANEXOS a cumplimentar ( pestañas verdes)"]
[]
[1,"Completar los datos cualitativos del proyecto en la pestaña \"proyecto\".  Las casillas a rellenar estan sombreadas en gris. "]
[2,"La herramienta incluye diferentes pestañas de un plan economico financiero. Se rellenan las pestañas de color verde que se llaman ANEXOS.El resto de pestañas en color rojo nos devuelven información para analizar y son imprimibles para entrega."]
[]
[3,"En general , el método para seleccionar un elemento de cualquier lista será: "]
[null,"3.1","Listas fijas: \"anexo inversión\" por ejemplo, que ofrecen ciertas categorías con la opción de 3 nuevas líneas para categorías extra . Se rellenan de forma directa las casillas grises de la tabla. No se tiene la opción de modificar los conceptos. "]
[null,"3.2","Listas desplegables: \"anexo ingresos\" por ejemplo, que tienen un bloque de acción dos botones de acción: "]
[null,null,"Crear nuevo: Crea una nueva fila en la que se rellenan las casillas grises . La casilla gris tiene un botón de desplegable que despliega una lista de la que elegir opciones . Se tiene la opción de modificar manualmente el concepto. "]
[4,"Los elementos numéricos a introducir se incluirán directamente seleccionando la casilla e introduciendo manualmente la cantidad ( casillas GRISES ) , en casillas blancas no rellenar que son fórmulas o datos. Hay casillas en color verde claro que son fórmulas que se pueden borrar , por si interesa al usuario poner un dato concreto."]
[null,null,"En las casillas grises: se introducen manualmente los datos: números o texto. "]
[null,null,"En las casillas verdes: hay fórmulas que calculan datos de referencia, si el usuario tiene el dato, puede borrarlas e introducir el dato numérico."]
[null,null,"En las casillas blancas: estan fórmulas o datos no editables."]
[5,"Consultar la pestaña \"1.indice\" para navegar por la herramienta, completando los datos a incluir y consultando las pestañas informativas en caso de necesidad"]
[6,"Una vez completada una pestaña , marcar la opcion \"Pestaña completa\" en la parte superior de la pestaña ."]
[]
[]
[]
[null,"RESULTADOS ( pestañas rojas)"]
[]
[1,"Una vez cumplimentados todos los inputs en los respectivos anexos , se podrán consultar todos los resultados imprimibles en las diferentes pestañas. "]
[2,"Estas pestañas de resultados estarán fijadas en función de los datos introducidos en los anexos y no se podrán modificar. "]
[3,"Pulsando el botón \"imprimir resultados\" de la pestaña de \"2.proyecto\" se podrán imprimir directamente en formato PDF los anexos en rojo. Si se quiere imprimir otras pestañas u otra configuración se deberá seleccionar \"archivo\" , luego \"imprimir\" y ahí configurar la opción deseada."]

{"sheet":"1.INDICE","index":2,"n_rows":25,"n_cols":7,"rows_kept":25,"cut":false,"hidden":false,"merged":[[0,2,1,4]]}
["INDICE "]
[]
[]
[]
[]
[]
[null,"PESTAÑA ","NOMBRE ","Checklist","DEFINICIÓN","INSTRUCCIONES ","Checklist"]
[null,0,"INSTRUCCIONES DE USO ",null,"Son las instrucciones generales , que conviene leer antes de completar cualquier dato de cara a entender el funcionamiento y aprovechar el tiempo al máximo. "]
[null,1,"ÍNDICE",null,"Esta pestaña."]
[null,2,"PROYECTO",false,"Son los datos iniciales que tenemos que complementar sobre el proyecto. ","Hay que completar la fecha inicial en la que empezaría el proyecto (sobre esta información se rellenan las tablas automaticamente). Asi mismo con el nombre del proyecto y la descripcion. Si no sabemos la forma juridica con la que vamos a empezar se recomienda poner en \"Tipo Impositivo\" (como en el impuesto sobre beneficios/excedentes) el valor correspondiente a 25% . ",{"$f":"IF(D10=TRUE,\"COMPLETADO\",\"PENDIENTE\")","v":"PENDIENTE"}]
[null,3,"INVERSIÓN_FINANCIACIÓN",null,"Es el resumen de lo que hemos completado en la pestaña \"3.1 Anexo inversión\" y en la pestña \"3.2 Anexo financiación\" de tal manera quepara poder comenar el proyecto la inversión tiene que ser igual a la financiación. "]
[null,null,"3.1 ANEXO INVERSIÓN",false,"Nos referimos a la inversión incial. Consiste en listar y calcular en euros, que elementos vamos a necesitar para comenzar el proyecto. ","Incluimos todos los importes en euros sin IVA, y en la columna IVA el % (si queremos consultar el IVA nos vamos a la pestaña tablas de referencia)                             1.Incluir los diferentes gastos de establecimiento para cada una de las categorías o para las 3 lineas extra disponibles.                                                                                                            2.Incluir los diferentes activos no corrientes de la inversión inicial asi como si es Inmovilizado Material (tangible) o Inmovilizado Inmaterial (intangible).                                                                                                         3.Para cada activo fijo (no corriente) de la inversión inicial , se calcula la parte amortizada a final de cada año con fórmula (si se quiere amortizar otra cantidad , se pueden quitar las fórmulas).                                                                                            4. Para cada activo corriente:  hay que incluirlos en su fila correspondiente si son existencias (productos para vender) o dinero líquido, tesorería (efectivo).",{"$f":"IF(D12=TRUE,\"COMPLETADO\",\"PENDIENTE\")","v":"PENDIENTE"}]
[null,null,"3.2 ANEXO FINANCIACIÓN",false,"Nos referimos a la financiación inicial. Consiste en listar y calcular en euros, las fuentes de financiación vamos a utilizar para costear la inversión inicial. Tanto financiación propia como ajena al proyecto.","1.Incluir las cantidades deseadas para fondos propios , financiacion ajena a corto plazo (menos de un año) y a largo plazo (mas de un año)                                                                                 2.En caso de querer simular un prestamo: incluir capital inicial , periodo de devolución , tipo de interes y gastos de establecimiento.                                     ","PENDIENTE"]
[null,4,"INGRESOS",null,"Esta pestaña es resumen de lo que hemos incluido en la pestaña \"4.1 anexo ingresos\"."]
[null,null,"4.1 ANEXO INGRESOS",false,"Nos referimos a los ingresos que obtenemos en el proyecto por vender productos u ofrecer servicios o ambas cosas. En los cultivos depende mucho de la productividad por ello se ha incorporado una tabla específica.  Se han separado en dos tablas de Ingresos por ventas/servicios o Otros ingresos, por si quien use la tabla desea verlo separado pero todos los ingresos se podrían introducir simplemente en la primera tabla. ","1.En las tablas de ingresos por ventas de productos o servicios, incluir el producto o servicio  y su precio estimado SIN IVA. Incluir el porcentaje de IVA (podemos consultar tablas de referencia). Despues, incluir la cantidad esperada de ventas en cada uno de los meses. Los productos que cultivemos en la tabla de ingresos por ventas de productos o servicios:  si es un producto que cultivamos, indicarlo en el desplegable seleccionando SI o NO.El limite de filas es de 30 (osea ese será el limite de productos a introducir).                                                                                            2.En la tabla de otros ingresos , incluir el resto de ingresos no especificados con el mismo metodo. El limite de filas es de 10 (osea ese será el limite de productos a introducir).                                                                                                                                            3. Calculadora de productividad (ojo no sirve para planificacion de cultivos los caluclos de superficie y de productividad habria que hacerlos con otra herramienta de planificación que tenga en cuenta, técnicos de cultivo, asociaciones, rotaciones y marcos de plantación).  Para completarla  , en cada producto incluido en el deslegable o introducirlo a mano  y el porcentaje de la parcela destinado a el . Los datos de productividad por cultivo provienen de los datos de producción medios de la Comunidad de Madrid en agricultura convencional en 2018. Se pueden editar la \"Productividad kg/m2/ciclo\" y los \"Ciclos anuales de producción\" en el cuadro de productividad.                                                                                                                                                                                                                                  4. Relación entre los productos cultivados y los productos vendidos .Si cultivamos mas o menos cantidad en kilogramos de lo que vendemos nos saldrá un aviso.","PENDIENTE"]
[null,5,"GASTOS FIJOS ",null,"Esta pestaña es resumen de lo que hemos incluido en la pestaña \"5.1 anexo gastos fijos\"."]
[null,null,"5.1 ANEXO GASTOS FIJOS ",false,"Nos referimos a aquellos gastos que tenemos que pagar todos los meses y no dependen del volumen de ingresos (es decir que aunque vendamos mas o vendamos menos los tenemos que pagar).","1.Para cada nuevo gasto fijo seleccionado , incluir los gastos fijos de cada mes del primer año.                                                                                                                            2.En la tabla de otros gastos incluir los gastos fijos extra para cada uno de los meses.        ","PENDIENTE"]
[null,6,"GASTOS VARIABLES",null,"Esta pestaña es resumen de lo que hemos incluido en la pestaña \"6.1 anexo gastos variables\"."]
[null,null,"6.1 ANEXO GASTOS VARIABLES ",false,"Nos referimos a aquellos gastos que dependen directamente del volumen de ingresos (es decir que si tenemos mas ingresos , tenemos mas gastos variables y si tenemos menos ingresos , tenemos menos gastos variables). ","1.Completar , para cada tipo de producto o servicio , con los gastos unitarios correspondientes a cada una de las categorias de la tabla. ","PENDIENTE"]
[null,7,"CUENTA DE RESULTADOS ",null,"Es la tabla resumen de ingresos y gastos (tanto fijos como variables). "]
[null,8,"IMPUESTOS ",null,"Nos referimos a IVA y a IRPF estimado que tendriamos que pagar (soportar) o recibir (devengar)."]
[null,9,"PLAN TESORERÍA",null,"Esta pestaña es reumen de \"anexo 9.1 tesorería\"."]
[null,null,"9.1 ANEXO TESORERÍA ",false,"Es una tabla complementraia al resto. Nos referimos a plan de tesorería que consiste en planificar  por un lado a los cobros (el dinero que recibimos) y a los pagos (el dinero saliente) con el objetivo de no tener un flujo negativo (que nos falte dinero para hacer frente a los pagos).  ","En este caso los resultados  son completamente modificables ( van en gris ) pero se han dejado una formula de referencia por si aun no sabemos la informacion dejarlo con la hipóteis .de que los cobros son iguales a los ingresos (todo se cobra al contado) y que los pagos son iguales a los gastos (todo se abona al contado). En caso de tener otros datos, se puede modificar.","PENDIENTE"]
[null,10,"BALANCE",null,"Es una tabla complementaria al resto. Nos referimos a Balance de Situación a final de cada año.  Nos sirve para saber cuanto valor tiene en euros el activo (aquello que posee la organización) y como se distribuye entre activo fijo y activo circulante. Y por otro lado como es su estructura de pasivo (que recursos propios  ajenos cuenta la organizacion para cubrir el activo). Son datos aproximados."]
[null,null,"TABLAS REFERENCIA  ",null,"Hemos incluidos diversas tablas que tienen que ver con las amortizaciones contables,Impuesto de Valor Añadido, productividad, que son datos que conviene revisar a modo de consulta."]

{"sheet":"2.PROYECTO","index":3,"n_rows":42,"n_cols":16,"rows_kept":42,"cut":false,"hidden":false,"merged":[[39,1,39,5],[1,2,2,4],[34,1,34,5],[6,1,6,5],[14,1,14,5],[17,1,21,5],[25,1,25,5],[28,1,28,5],[31,1,31,5]]}
[]
["Volver al Indice "]
[]
[]
[]
[" "]
[null,"DATOS GENERALES PROYECTO"]
[]
[]
[null,"Fecha de inicio del proyecto (DIA/MES/AÑO)",null,"Tipo de empresa ",null,"Tipo impositivo: Gravamen (%) sobre beneficios/excedentes "]
[]
[null,null,null,null,null,null," "," "]
[null,null,null,null,null,null,null,null,null,null,null,null,null,null,null," "]
[null,"Nombre emprendimiento"]
[]
[]
[null,"Breve descripción emprendimiento"]
[]
[]
[]
[]
[]
[]
[]
[null,"Nombre de la persona que rellena la tabla ",null,null,null,null,null," "]
[]
[]
[null,"Rol dentro del proyecto"]
[null,null,null,null,null,null,null,null,null,"  "]
[null,null,null,null,null,null,null,null,null,null,null,null,null," "]
[null,"Fecha en la que se completa la tabla (DIA/MES/AÑO)"]
[null,null,null,null,null,null,null,null,null," "]
[]
[null,"Web del proyecto y RRSS (si la tiene) ",null,null,null,null,null,null,null," "]
[]
[]
[null,"Superficie de la parcela  (en m²)",null,"% dedicado a cultivo ",null,"Superficie cultivada  (en m²)"]
[null,null,null,null,null,{"$f":"+B38*D38","v":0},null,null,null,null," "]
[]
[null,{"$f":"IF(B38/2<F38,\"\",\"La superficie cultivada tiene que ser al menos la mitad de la superficie total\")","v":"La superficie cultivada tiene que ser al menos la mitad de la superficie total"}]
[]
[null,null,null,null,null,null," "]

{"sheet":"ANEXO INVERSIÓN","index":4,"n_rows":48,"n_cols":19,"rows_kept":48,"cut":false,"hidden":false,"merged":[[19,9,19,12],[19,15,19,18],[6,2,6,3]]}
[null,"Volver al Indice "]
[null,"Volver a resultados"]
[]
[]
[]
[]
[null,null,"ANEXO INVERSION INICIAL "]
[]
[null,null,null,null,"Importe","Importe con IVA "]
[null,null,"IVA","GASTOS DE ESTABLECIMIENTO",{"$f":"SUM(E11:E20)","v":0},{"$f":"SUM(F11:F20)","v":0}]
[null,null,{"$f":"VLOOKUP(D11,'TABLAS REFERENCIA '!$H$8:$I$160,2,FALSE)","v":0},"Licencia Actividad",null,{"$f":"IF(E11=\"\",\"\",E11*C11+E11)","v":""}]
[null,null,{"$f":"VLOOKUP(D12,'TABLAS REFERENCIA '!$H$8:$I$160,2,FALSE)","v":0.21},"Permisos",null,{"$f":"IF(E12=\"\",\"\",E12*C12+E12)","v":""}]
[null,null,{"$f":"VLOOKUP(D13,'TABLAS REFERENCIA '!$H$8:$I$160,2,FALSE)","v":0.21},"Gastos Constitución",null,""]
[null,null,{"$f":"VLOOKUP(D14,'TABLAS REFERENCIA '!$H$8:$I$160,2,FALSE)","v":0.21},"Obras y reformas",null,""]
[null,null,{"$f":"VLOOKUP(D15,'TABLAS REFERENCIA '!$H$8:$I$160,2,FALSE)","v":0},"Fianza o Aval Alquiler Local",null,""]
[null,null,0.21,"Asesoramiento inicial",null,""]
[null,null,null,null,null,"",null,null,"AMORTIZACIONES DE LA INVERSION INICIAL ",null,null,null,null,null,"INVERSIONES POSTERIORES A LA INVERSIÓN INICIAL "]
[null,null,null,null,null,""]
[null,null,null,null,null,""]
[null,null,null,null,null,"",null,null,"TIPO DE INVERSION ","AMORTIZACION DE LA INVERSION INICIAL (DATOS INFORMATIVOS)",null,null,null,"AMORTIZACION ACUMULADA","TIPO DE INVERSION ","INVERSIONES POSTERIORES A LA INVERSIÓN INICIAL "]
[null,"Clasificar: tangible / intangible","IVA","ACTIVO NO CORRIENTE",{"$f":"+SUM(E22:E38)","v":0},{"$f":"+SUM(F22:F38)","v":0},null,null,null,"AÑO 1","AÑO 2","AÑO 3","AÑO 4","Amortizacion anual %",null,"AÑO 1","AÑO 2","AÑO 3","AÑO 4"]
[null,"Inmovilizado Material (tangible)",{"$f":"VLOOKUP(D22,'TABLAS REFERENCIA '!$H$8:$I$160,2,FALSE)","v":0.21},"Terrenos y bienes naturales",null,{"$f":"IF(E22<>\"\",E22*C22+E22,\"\")","v":""},null,null,{"$f":"D22","v":"Terrenos y bienes naturales"},{"$f":"+E22*N22","v":0},{"$f":"+E22*N22","v":0},{"$f":"+E22*N22","v":0},{"$f":"+N22*E22","v":0},0.03,{"$f":"I22","v":"Terrenos y bienes naturales"}]
[null,"Inmovilizado Material (tangible)",{"$f":"VLOOKUP(D23,'TABLAS REFERENCIA '!$H$8:$I$160,2,FALSE)","v":0.21},"Construcciones",null,{"$f":"IF(E23<>\"\",E23*C23+E23,\"\")","v":""},null,null,"Construcciones",0,0,0,0,{"$f":"VLOOKUP(I23,'TABLAS REFERENCIA '!C9:D19,2,1)","v":0.1},{"$f":"I23","v":"Construcciones"}]
[null,"Inmovilizado Material (tangible)",{"$f":"VLOOKUP(D24,'TABLAS REFERENCIA '!$H$8:$I$160,2,FALSE)","v":0.21},"Maquinaria",null,"",null,null,"Maquinaria",0,0,0,0,0.13,"Maquinaria"]
[null,"Inmovilizado Material (tangible)",{"$f":"VLOOKUP(D25,'TABLAS REFERENCIA '!$H$8:$I$160,2,FALSE)","v":0.21},"Utillaje y herramienta",null,"",null,null,"Utillaje y herramienta",0,0,0,0,0.2,"Utillaje y herramienta"]
[null,"Inmovilizado Material (tangible)",0.21,"Instalación de riego ",{"$f":"+'TABLAS REFERENCIA '!$Q$8*'2.PROYECTO'!$F$38","v":0},0,null,null,"Instalación de riego ",0,0,0,0,0.1,"Instalación de riego "]
[null,"Inmovilizado Material (tangible)",0.21,"Otras instalaciones ",null,null,null,null,"Otras instalaciones ",0,0,0,0,0.1,"Otras instalaciones "]
[null,"Inmovilizado Material (tangible)",{"$f":"VLOOKUP(D28,'TABLAS REFERENCIA '!$H$8:$I$160,2,FALSE)","v":0.21},"Mobiliario",null,"",null,null,"Mobiliario",0,0,0,0,0.1,"Mobiliario"]
[null,"Inmovilizado Material (tangible)",{"$f":"VLOOKUP(D29,'TABLAS REFERENCIA '!$H$8:$I$160,2,FALSE)","v":0.21},"Equipos para proceso de información",null,"",null,null,"Equipos para proceso de información",0,0,0,0,0.25,"Equipos para proceso de información"]
[null,"Inmovilizado Material (tangible)",{"$f":"VLOOKUP(D30,'TABLAS REFERENCIA '!$H$8:$I$160,2,FALSE)","v":0.21},"Elementos de transporte",null,"",null,null,"Elementos de transporte",0,0,0,0,0.15,"Elementos de transporte"]
[null,"Inmovilizado Inmaterial (intangible)",{"$f":"VLOOKUP(D31,'TABLAS REFERENCIA '!$H$8:$I$160,2,FALSE)","v":0.21},"Gastos de inv.y des., pro. intelectual y derechos de traspaso",null,"",null,null,"Gastos de inv.y des., pro. intelectual y derechos de traspaso",0,0,0,0,0.2,"Gastos de inv.y des., pro. intelectual y derechos de traspaso"]
[null,"Inmovilizado Inmaterial (intangible)",{"$f":"VLOOKUP(D32,'TABLAS REFERENCIA '!$H$8:$I$160,2,FALSE)","v":0.21},"Aplicaciones informáticas",null,"",null,null,"Aplicaciones informáticas",0,0,0,0,0.1,"Aplicaciones informáticas"]
[null,"Inmovilizado Inmaterial (intangible)",0.21,"Imagen corporativa",null,""]
[null,null,null,null,null,""]
[]
[]
[null,null,null,null,null,""]
[null,null,null,null,null,""]
[null,"Clasificar: Existencias / Efectivo","IVA","ACTIVO CORRIENTE",{"$f":"+SUM(E40:E45)","v":0},{"$f":"+SUM(F40:F45)","v":0},null,null,null,{"$f":"+SUM(J22:J38)","v":0},{"$f":"+SUM(K22:K38)","v":0},{"$f":"+SUM(L22:L38)","v":0},{"$f":"+SUM(M22:M38)","v":0},null,null,{"$f":"+SUM(P22:P38)","v":0},{"$f":"+SUM(Q22:Q38)","v":0},{"$f":"+SUM(R22:R38)","v":0},{"$f":"+SUM(S22:S38)","v":0}]
[null,"Existencias",{"$f":"VLOOKUP(D40,'TABLAS REFERENCIA '!$H$8:$I$160,2,FALSE)","v":0.21},"Stock Inicial de material para la venta",null,{"$f":"IF(E40<>\"\",E40*C40+E40,\"\")","v":""}]
[null,"Efectivo",{"$f":"VLOOKUP(D41,'TABLAS REFERENCIA '!$H$8:$I$160,2,FALSE)","v":0},"Tesorería",null,{"$f":"IF(E41<>\"\",E41*C41+E41,\"\")","v":""}]
[null,null,null,null,null,{"$f":"IF(E42<>\"\",E42*C45+E42,\"\")","v":""}]
[]
[]
[null,null,null,null,null,{"$f":"IF(E45<>\"\",E45*C46+E45,\"\")","v":""}]
[null,null,"TOTAL INVERSIÓN INICIAL","TOTALES ",{"$f":"E10+E21+E39","v":0},{"$f":"F39+F21+F10","v":0}]
[]
[null,null,null,null,null,null,null,null,null,null,null,null,null," "]

{"sheet":"ANEXO FINANCIACIÓN","index":5,"n_rows":371,"n_cols":11,"rows_kept":371,"cut":false,"hidden":false,"merged":[[28,2,28,3],[9,8,9,9],[21,10,22,10],[7,1,7,2],[7,5,7,9],[21,5,22,5],[21,6,22,6],[21,7,22,7],[21,8,22,8],[21,9,22,9]]}
[]
[null,"Volver al Indice "]
[null,"Volver a resultados"]
[]
[null,"CUADRO FINANCIACIÓN",null,null,null,"CALCULADORA DE PRÉSTAMOS "]
[]
[]
[null,"FINANCIACIÓN",null,null,null,"EJEMPLO DE PRESTAMO 1"]
[]
[null,null,null,null,null,"CANTIDAD A SOLICITAR (EUROS):",null,null,{"$f":"+C29","v":"FINANCIACIÓN EXACTA"}]
[null,"FONDOS PROPIOS",{"$f":"SUM(C12:C15)","v":0},null,null,"PERIODO DE DEVOLUCION (AÑOS)"]
[null,"Capital Social",null,null,null,"TIPO DE INTERES (%)"]
[null,"Subvenciones",null,null,null,"COSTES DE LA OPERACIÓN (%)"]
[null,"Otros fondos propios "]
[null,".",null,null,null,"CUADRO DE AMORTIZACION","AÑO 1","AÑO 2","AÑO 3","AÑO 4 "]
[null,"FINANCIACIÓN AJENA A L/P",{"$f":"SUM(C17:C19)","v":0},null,null,"Intereses (EUROS) ",{"$f":"+SUM(H24:H35)","v":0},{"$f":"SUM(H36:H47)","v":0},{"$f":"SUM(H48:H59)","v":0},{"$f":"SUM(H60:H71)","v":0}]
[null,"Deudas con entidades de crédito a largo plazo",{"$f":"+G10","v":0},null,null,"Devolución del principal (EUROS)",{"$f":"SUM(I24:I35)","v":0},{"$f":"SUM(I36:I47)","v":0},{"$f":"SUM(I48:I59)","v":0},{"$f":"SUM(I60:I71)","v":0}]
[null,"Otras deudas a largo plazo",null,null,null,"Importe total de las cuotas (EUROS)",{"$f":"+G16+G17","v":0},{"$f":"+H16+H17","v":0},{"$f":"+I16+I17","v":0},{"$f":"J16+J17","v":0}]
[null,".",null,null,null,"Comisiones apertura (EUROS)",{"$f":"+G10*G13","v":0}]
[null,"FINANCIACIÓN AJENA A C/P",{"$f":"+SUM(C21:C24)","v":0}]
[null,"Proveedores"]
[null,"Deudas con entidades de crédito a corto plazo",null,null,null,"Periodo","Cuota mensual","Intereses","Amortizado ","Capital amortizado acumulado","Capital pendiente"]
[null,"Deudas con las Administraciones Públicas"]
[null,"Otras deudas a corto plazo",null,null,1,{"$f":"IF($G$11*12>=E24,E24,\"\")","v":""},{"$f":"IF(F24=\"\",\"\",($G$10*$G$12/12)/(1-(1+($G$12/12))^(-$G$11*12)))","v":""},{"$f":"IF(F24=\"\",\"\",$G$10*$G$12/12)","v":""},{"$f":"IF(F24=\"\",\"\",G24-H24)","v":""},{"$f":"IF(F24=\"\",\"\",I24)","v":""},{"$f":"IF(F24=\"\",\"\",$G$10-J24)","v":""}]
[null,null,null,null,2,{"$f":"IF($G$11*12>=E25,E25,\"\")","v":""},{"$f":"IF(F25=\"\",\"\",($G$10*$G$12/12)/(1-(1+($G$12/12))^(-$G$11*12)))","v":""},{"$f":"IF(F25=\"\",\"\",K24*$G$12/12)","v":""},{"$f":"IF(F25=\"\",\"\",G25-H25)","v":""},{"$f":"IF(F25=\"\",\"\",I25+J24)","v":""},{"$f":"IF(F25=\"\",\"\",$G$10-J25)","v":""}]
[null,"TOTAL FINANCIACION",{"$f":"+C11+C16+C20","v":0},null,3,"","",{"$f":"IF(F26=\"\",\"\",K25*$G$12/12)","v":""},"",{"$f":"IF(F26=\"\",\"\",I26+J25)","v":""},""]
[null,null,null,null,4,"","","","","",""]
[null,null,null,null,5,"","","","","",""]
[null,{"$f":"IF(C29=0,\"\",\"Inversión y financiación no coinciden\")","v":"Inversión y financiación no coinciden"},{"$f":"+IF(C26<'ANEXO INVERSIÓN'!F46,\"FALTA DE FINANCIACIÓN\",IF(C26>'ANEXO INVERSIÓN'!F46,\"EXCESO DE FINANCIACIÓN\",\"FINANCIACIÓN EXACTA\"))","v":"FINANCIACIÓN EXACTA"},null,6,"","","","","",""]
[null,null,null,null,7,"","","","","",""]
[null,null,null,null,{"$f":"+E30+1","v":8},"","","","","",""]
[null,null,null,null,9,"","","","","",""]
[null,null,null,null,10,"","","","","",""]
[null,null,null,null,11,"","","","","",""]
[null,null,null,null,12,"","","","","",""]
[null,null,null,null,13,"","","","","",""]
[null,null,null,null,14,"","","","","",""]
[null,null,null,null,15,"","","","","",""]
[null,null,null,null,16,"","","","","",""]
[null,null,null,null,17,"","","","","",""]
[null,null,null,null,18,"","","","","",""]
[null,null,null,null,19,"","","","","",""]
[null,null,null,null,20,"","","","","",""]
[null,null,null,null,21,"","","","","",""]
[null,null,null,null,22,"","","","","",""]
[null,null,null,null,23,"","","","","",""]
[null,null,null,null,24,"","","","","",""]
[null,null,null,null,25,"","","","","",""]
[null,null,null,null,26,"","","","","",""]
[null,null,null,null,27,"","","","","",""]
[null,null,null,null,28,"","","","","",""]
[null,null,null,null,29,"","","","","",""]
[null,null,null,null,30,"","","","","",""]
[null,null,null,null,31,"","","","","",""]
[null,null,null,null,32,"","","","","",""]
[null,null,null,null,33,"","","","","",""]
[null,null,null,null,34,"","","","","",""]
[null,null,null,null,35,"","","","","",""]
[null,null,null,null,36,"","","","","",""]
[null,null,null,null,37,"","","","","",""]
[null,null,null,null,38,"","","","","",""]
[null,null,null,null,39,"","","","","",""]
[null,null,null,null,40,"","","","","",""]
[null,null,null,null,41,"","","","","",""]
[null,null,null,null,42,"","","","","",""]
[null,null,null,null,43,"","","","","",""]
[null,null,null,null,44,"","","","","",""]
[null,null,null,null,45,"","","","","",""]
[null,null,null,null,46,"","","","","",""]
[null,null,null,null,47,"","","","","",""]
[null,null,null,null,48,"","","","","",""]
[null,null,null,null,49,"","","","","",""]
[null,null,null,null,50,"","","","","",""]
[null,null,null,null,51,"","","","","",""]
[null,null,null,null,52,"","","","","",""]
[null,null,null,null,53,"","","","","",""]
[null,null,null,null,54,"","","","","",""]
[null,null,null,null,55,"","","","","",""]
[null,null,null,null,56,"","","","","",""]
[null,null,null,null,57,"","","","","",""]
[null,null,null,null,58,"","","","","",""]
[null,null,null,null,59,"","","","","",""]
[null,null,null,null,60,"","","","","",""]
[null,null,null,null,61,"","","","","",""]
[null,null,null,null,62,"","","","","",""]
[null,null,null,null,63,"","","","","",""]
[null,null,null,null,64,"","","","","",""]
[null,null,null,null,65,"","","","","",""]
[null,null,null,null,66,{"$f":"IF($G$11*12>=E89,E89,\"\")","v":""},{"$f":"IF(F89=\"\",\"\",($G$10*$G$12/12)/(1-(1+($G$12/12))^(-$G$11*12)))","v":""},"",{"$f":"IF(F89=\"\",\"\",G89-H89)","v":""},"",{"$f":"IF(F89=\"\",\"\",$G$10-J89)","v":""}]
[null,null,null,null,67,"","",{"$f":"IF(F90=\"\",\"\",K89*$G$12/12)","v":""},"",{"$f":"IF(F90=\"\",\"\",I90+J89)","v":""},""]
[null,null,null,null,68,"","","","","",""]
[null,null,null,null,69,"","","","","",""]
[null,null,null,null,70,"","","","","",""]
[null,null,null,null,71,"","","","","",""]
[null,null,null,null,{"$f":"+E94+1","v":72},"","","","","",""]
[null,null,null,null,73,"","","","","",""]
[null,null,null,null,74,"","","","","",""]
[null,null,null,null,75,"","","","","",""]
[null,null,null,null,76,"","","","","",""]
[null,null,null,null,77,"","","","","",""]
[null,null,null,null,78,"","","","","",""]
[null,null,null,null,79,"","","","","",""]
[null,null,null,null,80,"","","","","",""]
[null,null,null,null,81,"","","","","",""]
[null,null,null,null,82,"","","","","",""]
[null,null,null,null,83,"","","","","",""]
[null,null,null,null,84,"","","","","",""]
[null,null,null,null,85,"","","","","",""]
[null,null,null,null,86,"","","","","",""]
[null,null,null,null,87,"","","","","",""]
[null,null,null,null,88,"","","","","",""]
[null,null,null,null,89,"","","","","",""]
[null,null,null,null,90,"","","","","",""]
[null,null,null,null,91,"","","","","",""]
[null,null,null,null,92,"","","","","",""]
[null,null,null,null,93,"","","","","",""]
[null,null,null,null,94,"","","","","",""]
[null,null,null,null,95,"","","","","",""]
[null,null,null,null,96,"","","","","",""]
[null,null,null,null,97,"","","","","",""]
[null,null,null,null,98,"","","","","",""]
[null,null,null,null,99,"","","","","",""]
[null,null,null,null,100,"","","","","",""]
[null,null,null,null,101,"","","","","",""]
[null,null,null,null,102,"","","","","",""]
[null,null,null,null,103,"","","","","",""]
[null,null,null,null,104,"","","","","",""]
[null,null,null,null,105,"","","","","",""]
[null,null,null,null,106,"","","","","",""]
[null,null,null,null,107,"","","","","",""]
[null,null,null,null,108,"","","","","",""]
[null,null,null,null,109,"","","","","",""]
[null,null,null,null,110,"","","","","",""]
[null,null,null,null,111,"","","","","",""]
[null,null,null,null,112,"","","","","",""]
[null,null,null,null,113,"","","","","",""]
[null,null,null,null,114,"","","","","",""]
[null,null,null,null,115,"","","","","",""]
[null,null,null,null,116,"","","","","",""]
[null,null,null,null,117,"","","","","",""]
[null,null,null,null,118,"","","","","",""]
[null,null,null,null,119,"","","","","",""]
[null,null,null,null,120,"","","","","",""]
[null,null,null,null,121,"","","","","",""]
[null,null,null,null,122,"","","","","",""]
[null,null,null,null,123,"","","","","",""]
[null,null,null,null,124,"","","","","",""]
[null,null,null,null,125,"","","","","",""]
[null,null,null,null,126,"","","","","",""]
[null,null,null,null,127,"","","","","",""]
[null,null,null,null,128,"","","","","",""]
[null,null,null,null,129,"","","","","",""]
[null,null,null,null,130,{"$f":"IF($G$11*12>=E153,E153,\"\")","v":""},{"$f":"IF(F153=\"\",\"\",($G$10*$G$12/12)/(1-(1+($G$12/12))^(-$G$11*12)))","v":""},"",{"$f":"IF(F153=\"\",\"\",G153-H153)","v":""},"",{"$f":"IF(F153=\"\",\"\",$G$10-J153)","v":""}]
[null,null,null,null,131,"","",{"$f":"IF(F154=\"\",\"\",K153*$G$12/12)","v":""},"",{"$f":"IF(F154=\"\",\"\",I154+J153)","v":""},""]
[null,null,null,null,132,"","","","","",""]
[null,null,null,null,133,"","","","","",""]
[null,null,null,null,134,"","","","","",""]
[null,null,null,null,135,"","","","","",""]
[null,null,null,null,{"$f":"+E158+1","v":136},"","","","","",""]
[null,null,null,null,137,"","","","","",""]
[null,null,null,null,138,"","","","","",""]
[null,null,null,null,139,"","","","","",""]
[null,null,null,null,140,"","","","","",""]
[null,null,null,null,141,"","","","","",""]
[null,null,null,null,142,"","","","","",""]
[null,null,null,null,143,"","","","","",""]
[null,null,null,null,144,"","","","","",""]
[null,null,null,null,145,"","","","","",""]
[null,null,null,null,146,"","","","","",""]
[null,null,null,null,147,"","","","","",""]
[null,null,null,null,148,"","","","","",""]
[null,null,null,null,149,"","","","","",""]
[null,null,null,null,150,"","","","","",""]
[null,null,null,null,151,"","","","","",""]
[null,null,null,null,152,"","","","","",""]
[null,null,null,null,153,"","","","","",""]
[null,null,null,null,154,"","","","","",""]
[null,null,null,null,155,"","","","","",""]
[null,null,null,null,156,"","","","","",""]
[null,null,null,null,157,"","","","","",""]
[null,null,null,null,158,"","","","","",""]
[null,null,null,null,159,"","","","","",""]
[null,null,null,null,160,"","","","","",""]
[null,null,null,null,161,"","","","","",""]
[null,null,null,null,162,"","","","","",""]
[null,null,null,null,163,"","","","","",""]
[null,null,null,null,164,"","","","","",""]
[null,null,null,null,165,"","","","","",""]
[null,null,null,null,166,"","","","","",""]
[null,null,null,null,167,"","","","","",""]
[null,null,null,null,168,"","","","","",""]
[null,null,null,null,169,"","","","","",""]
[null,null,null,null,170,"","","","","",""]
[null,null,null,null,171,"","","","","",""]
[null,null,null,null,172,"","","","","",""]
[null,null,null,null,173,"","","","","",""]
[null,null,null,null,174,"","","","","",""]
[null,null,null,null,175,"","","","","",""]
[null,null,null,null,176,"","","","","",""]
[null,null,null,null,177,"","","","","",""]
[null,null,null,null,178,"","","","","",""]
[null,null,null,null,179,"","","","","",""]
[null,null,null,null,180,"","","","","",""]
[null,null,null,null,181,"","","","","",""]
[null,null,null,null,182,"","","","","",""]
[null,null,null,null,183,"","","","","",""]
[null,null,null,null,184,"","","","","",""]
[null,null,null,null,185,"","","","","",""]
[null,null,null,null,186,"","","","","",""]
[null,null,null,null,187,"","","","","",""]
[null,null,null,null,188,"","","","","",""]
[null,null,null,null,189,"","","","","",""]
[null,null,null,null,190,"","","","","",""]
[null,null,null,null,191,"","","","","",""]
[null,null,null,null,192,"","","","","",""]
[null,null,null,null,193,"","","","","",""]
[null,null,null,null,194,{"$f":"IF($G$11*12>=E217,E217,\"\")","v":""},{"$f":"IF(F217=\"\",\"\",($G$10*$G$12/12)/(1-(1+($G$12/12))^(-$G$11*12)))","v":""},"",{"$f":"IF(F217=\"\",\"\",G217-H217)","v":""},"",{"$f":"IF(F217=\"\",\"\",$G$10-J217)","v":""}]
[null,null,null,null,195,"","",{"$f":"IF(F218=\"\",\"\",K217*$G$12/12)","v":""},"",{"$f":"IF(F218=\"\",\"\",I218+J217)","v":""},""]
[null,null,null,null,196,"","","","","",""]
[null,null,null,null,197,"","","","","",""]
[null,null,null,null,198,"","","","","",""]
[null,null,null,null,199,"","","","","",""]
[null,null,null,null,{"$f":"+E222+1","v":200},"","","","","",""]
[null,null,null,null,201,"","","","","",""]
[null,null,null,null,202,"","","","","",""]
[null,null,null,null,203,"","","","","",""]
[null,null,null,null,204,"","","","","",""]
[null,null,null,null,205,"","","","","",""]
[null,null,null,null,206,"","","","","",""]
[null,null,null,null,207,"","","","","",""]
[null,null,null,null,208,"","","","","",""]
[null,null,null,null,209,"","","","","",""]
[null,null,null,null,210,"","","","","",""]
[null,null,null,null,211,"","","","","",""]
[null,null,null,null,212,"","","","","",""]
[null,null,null,null,213,"","","","","",""]
[null,null,null,null,214,"","","","","",""]
[null,null,null,null,215,"","","","","",""]
[null,null,null,null,216,"","","","","",""]
[null,null,null,null,217,"","","","","",""]
[null,null,null,null,218,"","","","","",""]
[null,null,null,null,219,"","","","","",""]
[null,null,null,null,220,"","","","","",""]
[null,null,null,null,221,"","","","","",""]
[null,null,null,null,222,"","","","","",""]
[null,null,null,null,223,"","","","","",""]
[null,null,null,null,224,"","","","","",""]
[null,null,null,null,225,"","","","","",""]
[null,null,null,null,226,"","","","","",""]
[null,null,null,null,227,"","","","","",""]
[null,null,null,null,228,"","","","","",""]
[null,null,null,null,229,"","","","","",""]
[null,null,null,null,230,"","","","","",""]
[null,null,null,null,231,"","","","","",""]
[null,null,null,null,232,"","","","","",""]
[null,null,null,null,233,"","","","","",""]
[null,null,null,null,234,"","","","","",""]
[null,null,null,null,235,"","","","","",""]
[null,null,null,null,236,"","","","","",""]
[null,null,null,null,237,"","","","","",""]
[null,null,null,null,238,"","","","","",""]
[null,null,null,null,239,"","","","","",""]
[null,null,null,null,240,"","","","","",""]
[null,null,null,null,241,"","","","","",""]
[null,null,null,null,242,"","","","","",""]
[null,null,null,null,243,"","","","","",""]
[null,null,null,null,244,"","","","","",""]
[null,null,null,null,245,"","","","","",""]
[null,null,null,null,246,"","","","","",""]
[null,null,null,null,247,"","","","","",""]
[null,null,null,null,248,"","","","","",""]
[null,null,null,null,249,"","","","","",""]
[null,null,null,null,250,"","","","","",""]
[null,null,null,null,251,"","","","","",""]
[null,null,null,null,252,"","","","","",""]
[null,null,null,null,253,"","","","","",""]
[null,null,null,null,254,"","","","","",""]
[null,null,null,null,255,"","","","","",""]
[null,null,null,null,256,"","","","","",""]
[null,null,null,null,257,"","","","","",""]
[null,null,null,null,258,{"$f":"IF($G$11*12>=E281,E281,\"\")","v":""},{"$f":"IF(F281=\"\",\"\",($G$10*$G$12/12)/(1-(1+($G$12/12))^(-$G$11*12)))","v":""},"",{"$f":"IF(F281=\"\",\"\",G281-H281)","v":""},"",{"$f":"IF(F281=\"\",\"\",$G$10-J281)","v":""}]
[null,null,null,null,259,"",{"$f":"IF(F282=\"\",\"\",($G$10*$G$12/12)/(1-(1+($G$12/12))^(-$G$11*12)))","v":""},{"$f":"IF(F282=\"\",\"\",K281*$G$12/12)","v":""},{"$f":"IF(F282=\"\",\"\",G282-H282)","v":""},{"$f":"IF(F282=\"\",\"\",I282+J281)","v":""},{"$f":"IF(F282=\"\",\"\",$G$10-J282)","v":""}]
[null,null,null,null,260,"","","","","",""]
[null,null,null,null,261,"","","","","",""]
[null,null,null,null,262,"","","","","",""]
[null,null,null,null,263,"","","","","",""]
[null,null,null,null,{"$f":"+E286+1","v":264},"","","","","",""]
[null,null,null,null,265,"","","","","",""]
[null,null,null,null,266,"","","","","",""]
[null,null,null,null,267,"","","","","",""]
[null,null,null,null,268,"","","","","",""]
[null,null,null,null,269,"","","","","",""]
[null,null,null,null,270,"","","","","",""]
[null,null,null,null,271,"","","","","",""]
[null,null,null,null,272,"","","","","",""]
[null,null,null,null,273,"","","","","",""]
[null,null,null,null,274,"","","","","",""]
[null,null,null,null,275,"","","","","",""]
[null,null,null,null,276,"","","","","",""]
[null,null,null,null,277,"","","","","",""]
[null,null,null,null,278,"","","","","",""]
[null,null,null,null,279,"","","","","",""]
[null,null,null,null,280,"","","","","",""]
[null,null,null,null,281,"","","","","",""]
[null,null,null,null,282,"","","","","",""]
[null,null,null,null,283,"","","","","",""]
[null,null,null,null,284,"","","","","",""]
[null,null,null,null,285,"","","","","",""]
[null,null,null,null,286,"","","","","",""]
[null,null,null,null,287,"","","","","",""]
[null,null,null,null,288,"","","","","",""]
[null,null,null,null,289,"","","","","",""]
[null,null,null,null,290,"","","","","",""]
[null,null,null,null,291,"","","","","",""]
[null,null,null,null,292,"","","","","",""]
[null,null,null,null,293,"","","","","",""]
[null,null,null,null,294,"","","","","",""]
[null,null,null,null,295,"","","","","",""]
[null,null,null,null,296,"","","","","",""]
[null,null,null,null,297,"","","","","",""]
[null,null,null,null,298,"","","","","",""]
[null,null,null,null,299,"","","","","",""]
[null,null,null,null,300,"","","","","",""]
[null,null,null,null,301,"","","","","",""]
[null,null,null,null,302,"","","","","",""]
[null,null,null,null,303,"","","","","",""]
[null,null,null,null,304,"","","","","",""]
[null,null,null,null,305,"","","","","",""]
[null,null,null,null,306,"","","","","",""]
[null,null,null,null,307,"","","","","",""]
[null,null,null,null,308,"","","","","",""]
[null,null,null,null,309,"","","","","",""]
[null,null,null,null,310,"","","","","",""]
[null,null,null,null,311,"","","","","",""]
[null,null,null,null,312,"","","","","",""]
[null,null,null,null,313,"","","","","",""]
[null,null,null,null,314,"","","","","",""]
[null,null,null,null,315,"","","","","",""]
[null,null,null,null,316,"","","","","",""]
[null,null,null,null,317,"","","","","",""]
[null,null,null,null,318,"","","","","",""]
[null,null,null,null,319,"","","","","",""]
[null,null,null,null,320,"","","","","",""]
[null,null,null,null,321,"","","","","",""]
[null,null,null,null,322,{"$f":"IF($G$11*12>=E345,E345,\"\")","v":""},"","","","",""]
[null,null,null,null,323,"",{"$f":"IF(F346=\"\",\"\",($G$10*$G$12/12)/(1-(1+($G$12/12))^(-$G$11*12)))","v":""},{"$f":"IF(F346=\"\",\"\",K345*$G$12/12)","v":""},{"$f":"IF(F346=\"\",\"\",G346-H346)","v":""},{"$f":"IF(F346=\"\",\"\",I346+J345)","v":""},{"$f":"IF(F346=\"\",\"\",$G$10-J346)","v":""}]
[null,null,null,null,324,"","","","","",""]
[null,null,null,null,325,"","","","","",""]
[null,null,null,null,326,"","","","","",""]
[null,null,null,null,327,"","","","","",""]
[null,null,null,null,{"$f":"+E350+1","v":328},"","","","","",""]
[null,null,null,null,329,"","","","","",""]
[null,null,null,null,330,"","","","","",""]
[null,null,null,null,331,"","","","","",""]
[null,null,null,null,332,"","","","","",""]
[null,null,null,null,333,"","","","","",""]
[null,null,null,null,334,"","","","","",""]
[null,null,null,null,335,"","","","","",""]
[null,null,null,null,336,"","","","","",""]
[null,null,null,null,337,"","","","","",""]
[null,null,null,null,338,"","","","","",""]
[null,null,null,null,339,"","","","","",""]
[null,null,null,null,340,"","","","","",""]
[null,null,null,null,341,"","","","","",""]
[null,null,null,null,342,"","","","","",""]
[null,null,null,null,343,"","","","","",""]
[null,null,null,null,344,"","","","","",""]
[null,null,null,null,345,"","","","","",""]
[null,null,null,null,346,"","","","","",""]
[null,null,null,null,347,"","","","","",""]
[null,null,null,null,348,"","","","","",""]

{"sheet":"ANEXO INGRESOS","index":6,"n_rows":221,"n_cols":20,"rows_kept":221,"cut":false,"hidden":false,"merged":[[98,2,98,7],[5,2,5,18],[10,2,10,18],[6,2,6,4],[73,2,73,7],[90,5,90,6],[48,2,48,6]]}
[]
[null,"Volver al Indice "]
[null,"Volver a ingresos"]
[null,"Consultar tablas referencia "]
[]
[null,null,"INGRESOS POR VENTAS DE PRODUCTOS O SERVICIOS"]
[null,null,"INCREMENTO/REDUCCION  DE INGRESOS  INTERANUAL (EN %) "]
[null,null,"DE AÑO 1 A AÑO 2 ","DE AÑO 2 A AÑO 3 ","DE AÑO 3 A AÑO 4 "]
[]
[]
[null,null,"Unidades vendidas "]
[null,null,"Columna1","Columna2","Columna22","Columna3","Columna4",{"$f":"'7.CUENTA DE RESULTADOS '!C20","v":"1900enero"},{"$f":"'7.CUENTA DE RESULTADOS '!D20","v":"1900enero"},{"$f":"'7.CUENTA DE RESULTADOS '!E20","v":"1900febrero"},{"$f":"'7.CUENTA DE RESULTADOS '!F20","v":"1900marzo"},{"$f":"'7.CUENTA DE RESULTADOS '!G20","v":"1900abril"},{"$f":"'7.CUENTA DE RESULTADOS '!H20","v":"1900mayo"},{"$f":"'7.CUENTA DE RESULTADOS '!I20","v":"1900junio"},{"$f":"'7.CUENTA DE RESULTADOS '!J20","v":"1900julio"},{"$f":"'7.CUENTA DE RESULTADOS '!K20","v":"1900agosto"},{"$f":"'7.CUENTA DE RESULTADOS '!L20","v":"1900septiembre"},{"$f":"'7.CUENTA DE RESULTADOS '!M20","v":"1900octubre"},{"$f":"'7.CUENTA DE RESULTADOS '!N20","v":"1900noviembre"}]
[null,"¿Es un producto que también cultivamos? Seleccionar del desplegable: SI o NO del desplegable. Si el producto es cesta indicar No en el desplegable. ","IVA %","Producto/Servicio","Especificar tipo de unidad: kilogramos, litros, numero de formaciones, números de cestas","Precio unidad estimado ","Precio unidad estimado                (con IVA)","Mes 1","Mes 2","Mes 3","Mes 4","Mes 5","Mes 6","Mes 7","Mes 8","Mes 9","Mes 10","Mes 11","Mes 12","TOTALES POR AÑO / PRODUCTO"]
[null,"SI ",{"$f":"IF('ANEXO INGRESOS'!$D14=\"\",\"\",VLOOKUP('ANEXO INGRESOS'!$D14,'TABLAS REFERENCIA '!$H$8:$I$43,2,0))","v":""},null,null,null,{"$f":"IF(F14<>\"\",F14*C14+F14,\"\")","v":""},null,null,null,null,null,null,null,null,null,null,null,null,{"$f":"SUM(H14:S14)","v":0}]
[null,"SI ",{"$f":"IF('ANEXO INGRESOS'!$D15=\"\",\"\",VLOOKUP('ANEXO INGRESOS'!$D15,'TABLAS REFERENCIA '!$H$8:$I$43,2,0))","v":""},null,null,null,"",null,null,null,null,null,null,null,null,null,null,null,null,0]
[null,"SI ",{"$f":"IF('ANEXO INGRESOS'!$D16=\"\",\"\",VLOOKUP('ANEXO INGRESOS'!$D16,'TABLAS REFERENCIA '!$H$8:$I$43,2,0))","v":""},null,null,null,"",null,null,null,null,null,null,null,null,null,null,null,null,0]
[null,"SI ",{"$f":"IF('ANEXO INGRESOS'!$D17=\"\",\"\",VLOOKUP('ANEXO INGRESOS'!$D17,'TABLAS REFERENCIA '!$H$8:$I$43,2,0))","v":""},null,null,null,"",null,null,null,null,null,null,null,null,null,null,null,null,0]
[null,"SI ",{"$f":"IF('ANEXO INGRESOS'!$D18=\"\",\"\",VLOOKUP('ANEXO INGRESOS'!$D18,'TABLAS REFERENCIA '!$H$8:$I$43,2,0))","v":""},null,null,null,"",null,null,null,null,null,null,null,null,null,null,null,null,0]
[null,"SI ",{"$f":"IF('ANEXO INGRESOS'!$D19=\"\",\"\",VLOOKUP('ANEXO INGRESOS'!$D19,'TABLAS REFERENCIA '!$H$8:$I$43,2,0))","v":""},null,null,null,"",null,null,null,null,null,null,null,null,null,null,null,null,0]
[null,"SI ",{"$f":"IF('ANEXO INGRESOS'!$D20=\"\",\"\",VLOOKUP('ANEXO INGRESOS'!$D20,'TABLAS REFERENCIA '!$H$8:$I$43,2,0))","v":""},null,null,null,"",null,null,null,null,null,null,null,null,null,null,null,null,0]
[null,"SI ",{"$f":"IF('ANEXO INGRESOS'!$D21=\"\",\"\",VLOOKUP('ANEXO INGRESOS'!$D21,'TABLAS REFERENCIA '!$H$8:$I$43,2,0))","v":""},null,null,null,"",null,null,null,null,null,null,null,null,null,null,null,null,0]
[null,"SI ",{"$f":"IF('ANEXO INGRESOS'!$D22=\"\",\"\",VLOOKUP('ANEXO INGRESOS'!$D22,'TABLAS REFERENCIA '!$H$8:$I$43,2,0))","v":""},null,null,null,"",null,null,null,null,null,null,null,null,null,null,null,null,0]
[null,"SI ",{"$f":"IF('ANEXO INGRESOS'!$D23=\"\",\"\",VLOOKUP('ANEXO INGRESOS'!$D23,'TABLAS REFERENCIA '!$H$8:$I$43,2,0))","v":""},null,null,null,"",null,null,null,null,null,null,null,null,null,null,null,null,0]
[null,"NO ",{"$f":"IF('ANEXO INGRESOS'!$D24=\"\",\"\",VLOOKUP('ANEXO INGRESOS'!$D24,'TABLAS REFERENCIA '!$H$8:$I$43,2,0))","v":""},null,null,null,"",null,null,null,null,null,null,null,null,null,null,null,null,0]
[null,"NO ",{"$f":"IF('ANEXO INGRESOS'!$D25=\"\",\"\",VLOOKUP('ANEXO INGRESOS'!$D25,'TABLAS REFERENCIA '!$H$8:$I$43,2,0))","v":""},null,null,null,"",null,null,null,null,null,null,null,null,null,null,null,null,{"$f":"SUM(H25:S25)","v":0}]
[null,null,{"$f":"IF('ANEXO INGRESOS'!$D26=\"\",\"\",VLOOKUP('ANEXO INGRESOS'!$D26,'TABLAS REFERENCIA '!$H$8:$I$43,2,0))","v":""},null,null,null,"",null,null,null,null,null,null,null,null,null,null,null,null,0]
[null,null,{"$f":"IF('ANEXO INGRESOS'!$D27=\"\",\"\",VLOOKUP('ANEXO INGRESOS'!$D27,'TABLAS REFERENCIA '!$H$8:$I$43,2,0))","v":""},null,null,null,"",null,null,null,null,null,null,null,null,null,null,null,null,0]
[null,null,{"$f":"IF('ANEXO INGRESOS'!$D28=\"\",\"\",VLOOKUP('ANEXO INGRESOS'!$D28,'TABLAS REFERENCIA '!$H$8:$I$43,2,0))","v":""},null,null,null,"",null,null,null,null,null,null,null,null,null,null,null,null,0]
[null,null,{"$f":"IF('ANEXO INGRESOS'!$D29=\"\",\"\",VLOOKUP('ANEXO INGRESOS'!$D29,'TABLAS REFERENCIA '!$H$8:$I$43,2,0))","v":""},null,null,null,"",null,null,null,null,null,null,null,null,null,null,null,null,{"$f":"SUM(H29:S29)","v":0}]
[null,null,{"$f":"IF('ANEXO INGRESOS'!$D30=\"\",\"\",VLOOKUP('ANEXO INGRESOS'!$D30,'TABLAS REFERENCIA '!$H$8:$I$43,2,0))","v":""},null,null,null,"",null,null,null,null,null,null,null,null,null,null,null,null,{"$f":"SUM(H30:S30)","v":0}]
[null,null,{"$f":"IF('ANEXO INGRESOS'!$D31=\"\",\"\",VLOOKUP('ANEXO INGRESOS'!$D31,'TABLAS REFERENCIA '!$H$8:$I$43,2,0))","v":""},null,null,null,{"$f":"IF(F31<>\"\",F31*C31+F31,\"\")","v":""},null,null,null,null,null,null,null,null,null,null,null,null,{"$f":"SUM(H31:S31)","v":0}]
[null,null,{"$f":"IF('ANEXO INGRESOS'!$D32=\"\",\"\",VLOOKUP('ANEXO INGRESOS'!$D32,'TABLAS REFERENCIA '!$H$8:$I$43,2,0))","v":""},null,null,null,{"$f":"IF(F32<>\"\",F32*C32+F32,\"\")","v":""},null,null,null,null,null,null,null,null,null,null,null,null,{"$f":"SUM(H32:S32)","v":0}]
[null,null,null,null,"TOTAL INGRESOS POR VENTAS",{"$f":"SUM(unidades_vendidas[[Precio unidad estimado ]])","v":0},{"$f":"SUM(unidades_vendidas[Precio unidad estimado                (con IVA)])","v":0},{"$f":"SUM(unidades_vendidas[Mes 1])","v":0},{"$f":"SUM(unidades_vendidas[Mes 2])","v":0},{"$f":"SUM(unidades_vendidas[Mes 3])","v":0},{"$f":"SUM(unidades_vendidas[Mes 4])","v":0},{"$f":"SUM(unidades_vendidas[Mes 5])","v":0},{"$f":"SUM(unidades_vendidas[Mes 6])","v":0},{"$f":"SUM(unidades_vendidas[Mes 7])","v":0},{"$f":"SUM(unidades_vendidas[Mes 8])","v":0},{"$f":"SUM(unidades_vendidas[Mes 9])","v":0},{"$f":"SUM(unidades_vendidas[Mes 10])","v":0},{"$f":"SUM(unidades_vendidas[Mes 11])","v":0},{"$f":"SUM(unidades_vendidas[Mes 12])","v":0}]
[]
[]
[]
[]
[]
[]
[]
[]
[]
[]
[]
[]
[]
[null,null,"OTROS INGRESOS "]
[]
[null,null,null,null,null,null,null,{"$f":"H12","v":"1900enero"},"1900enero","1900febrero","1900marzo","1900abril","1900mayo","1900junio","1900julio","1900agosto","1900septiembre","1900octubre","1900noviembre","TOTALES  "]
[null,null,"IVA %","OTROS INGRESOS ( en euros ) ","Especificar tipo de unidad: kilogramos, litros, numero de formaciones, números de cestas","Precio unidad estimado ","Precio unidad estimado                (con IVA)","Mes 1","Mes 2","Mes 3","Mes 4","Mes 5","Mes 6","Mes 7","Mes 8","Mes 9","Mes 10","Mes 11","Mes 12","AÑO"]
[null,null,null,null,null,null,{"$f":"IF('ANEXO INGRESOS'!$D51=\"\",\"\",'ANEXO INGRESOS'!$F51+'ANEXO INGRESOS'!$F51*'ANEXO INGRESOS'!$C51)","v":""},null,null,null,null,null,null,null,null,null,null,null,null,{"$f":"SUM(H51:S51)","v":0}]
[null,null,null,null,null,null,{"$f":"IF('ANEXO INGRESOS'!$D52=\"\",\"\",'ANEXO INGRESOS'!$F52+'ANEXO INGRESOS'!$F52*'ANEXO INGRESOS'!$C52)","v":""},null,null,null,null,null,null,null,null,null,null,null,null,0]
[null,null,null,null,null,null,{"$f":"IF('ANEXO INGRESOS'!$D53=\"\",\"\",'ANEXO INGRESOS'!$F53+'ANEXO INGRESOS'!$F53*'ANEXO INGRESOS'!$C53)","v":""},null,null,null,null,null,null,null,null,null,null,null,null,0]
[null,null,null,null,null,null,{"$f":"IF('ANEXO INGRESOS'!$D54=\"\",\"\",'ANEXO INGRESOS'!$F54+'ANEXO INGRESOS'!$F54*'ANEXO INGRESOS'!$C54)","v":""},null,null,null,null,null,null,null,null,null,null,null,null,0]
[null,null,null,null,null,null,{"$f":"IF('ANEXO INGRESOS'!$D55=\"\",\"\",'ANEXO INGRESOS'!$F55+'ANEXO INGRESOS'!$F55*'ANEXO INGRESOS'!$C55)","v":""},null,null,null,null,null,null,null,null,null,null,null,null,{"$f":"SUM(H55:S55)","v":0}]
[null,null,null,null,null,null,{"$f":"IF('ANEXO INGRESOS'!$D56=\"\",\"\",'ANEXO INGRESOS'!$F56+'ANEXO INGRESOS'!$F56*'ANEXO INGRESOS'!$C56)","v":""},null,null,null,null,null,null,null,null,null,null,null,null,{"$f":"SUM(H56:S56)","v":0}]
[null,null,null,null,"TOTAL OTROS INGRESOS",{"$f":"SUM(otros_ingresos[[Precio unidad estimado ]])","v":0},{"$f":"SUM(otros_ingresos[Precio unidad estimado                (con IVA)])","v":0},{"$f":"SUM(otros_ingresos[Mes 1])","v":0},{"$f":"SUM(otros_ingresos[Mes 2])","v":0},{"$f":"SUM(otros_ingresos[Mes 3])","v":0},{"$f":"SUM(otros_ingresos[Mes 4])","v":0},{"$f":"SUM(otros_ingresos[Mes 5])","v":0},{"$f":"SUM(otros_ingresos[Mes 6])","v":0},{"$f":"SUM(otros_ingresos[Mes 7])","v":0},{"$f":"SUM(otros_ingresos[Mes 8])","v":0},{"$f":"SUM(otros_ingresos[Mes 9])","v":0},{"$f":"SUM(otros_ingresos[Mes 10])","v":0},{"$f":"SUM(otros_ingresos[Mes 11])","v":0},{"$f":"SUM(otros_ingresos[Mes 12])","v":0}]
[]
[]
[]
[]
[]
[]
[]
[]
[]
[]
[]
[]
[]
[]
[]
[null,null,"CALCULADORA DE PRODUCTIVIDAD"]
[null,null,"Seleccionar cultivo con desplegable y apareceran sus datos en el resto de columnas - también consultar pestaña tabla de referencia la tabla \"d. Tabla de productividad y ciclos anuales por producto\"-. En caso de que no este en la tabla el usuario tendrá que investigar este dato. El usuario tendrá que introducir el porcentaje de parcela utilizado en todos los casos.  Ten en cuenta que esta calculadora de productividad, no es una calculadora de planificación de cultivos. La planificación de cultivos deberá hacerse a parte de esta herramienta de viabilidad económica. ",null,null,null,null,null,null,"Consultar tabla de referencia  "]
[]
[null,null,"Productividad (KILOS CULTIVADOS)"]
[null,null,"Cultivo ","porcentaje parcela cultivado","productividad Kg/m2/ciclo ","ciclos anuales  de produccion ","TOTALES kg/ CICLO ","TOTAL anual kg"]
[null,null,"Acelga",0.2,{"$f":"IF('ANEXO INGRESOS'!$C78=\"\",\"\",VLOOKUP('ANEXO INGRESOS'!$C78,'TABLAS REFERENCIA '!$K$7:$M$63,2,0))","v":2.1},{"$f":"IF('ANEXO INGRESOS'!$C78=\"\",\"\",VLOOKUP('ANEXO INGRESOS'!$C78,'TABLAS REFERENCIA '!$K$7:$M$63,3,FALSE))","v":2},{"$f":"IF(C78=\"\",\"\",'2.PROYECTO'!$F$38*Productividad[[#This Row],[porcentaje parcela cultivado]]*Productividad[[#This Row],[productividad Kg/m2/ciclo ]])","v":0},{"$f":"IF(OR('ANEXO INGRESOS'!$D78=\"\",'ANEXO INGRESOS'!$C78=\"\"),\"\",G78*F78)","v":0}]
[null,null,"Ajo tierno",0.2,{"$f":"IF('ANEXO INGRESOS'!$C79=\"\",\"\",VLOOKUP('ANEXO INGRESOS'!$C79,'TABLAS REFERENCIA '!$K$7:$M$63,2,0))","v":1.4},{"$f":"IF('ANEXO INGRESOS'!$C79=\"\",\"\",VLOOKUP('ANEXO INGRESOS'!$C79,'TABLAS REFERENCIA '!$K$7:$M$63,3,FALSE))","v":1},{"$f":"IF(C79=\"\",\"\",'2.PROYECTO'!$F$38*Productividad[[#This Row],[porcentaje parcela cultivado]]*Productividad[[#This Row],[productividad Kg/m2/ciclo ]])","v":0},{"$f":"IF(OR('ANEXO INGRESOS'!$D79=\"\",'ANEXO INGRESOS'!$C79=\"\"),\"\",G79*F79)","v":0}]
[null,null,"Cebolla tierna",0.1,{"$f":"IF('ANEXO INGRESOS'!$C80=\"\",\"\",VLOOKUP('ANEXO INGRESOS'!$C80,'TABLAS REFERENCIA '!$K$7:$M$63,2,0))","v":1.6},{"$f":"IF('ANEXO INGRESOS'!$C80=\"\",\"\",VLOOKUP('ANEXO INGRESOS'!$C80,'TABLAS REFERENCIA '!$K$7:$M$63,3,FALSE))","v":2},{"$f":"IF(C80=\"\",\"\",'2.PROYECTO'!$F$38*Productividad[[#This Row],[porcentaje parcela cultivado]]*Productividad[[#This Row],[productividad Kg/m2/ciclo ]])","v":0},{"$f":"IF(OR('ANEXO INGRESOS'!$D80=\"\",'ANEXO INGRESOS'!$C80=\"\"),\"\",G80*F80)","v":0}]
[null,null,"Alcachofa",0.3,{"$f":"IF('ANEXO INGRESOS'!$C81=\"\",\"\",VLOOKUP('ANEXO INGRESOS'!$C81,'TABLAS REFERENCIA '!$K$7:$M$63,2,0))","v":1.3},{"$f":"IF('ANEXO INGRESOS'!$C81=\"\",\"\",VLOOKUP('ANEXO INGRESOS'!$C81,'TABLAS REFERENCIA '!$K$7:$M$63,3,FALSE))","v":1},{"$f":"IF(C81=\"\",\"\",'2.PROYECTO'!$F$38*Productividad[[#This Row],[porcentaje parcela cultivado]]*Productividad[[#This Row],[productividad Kg/m2/ciclo ]])","v":0},{"$f":"IF(OR('ANEXO INGRESOS'!$D81=\"\",'ANEXO INGRESOS'!$C81=\"\"),\"\",G81*F81)","v":0}]
[null,null,"Coliflor",0.09,{"$f":"IF('ANEXO INGRESOS'!$C82=\"\",\"\",VLOOKUP('ANEXO INGRESOS'!$C82,'TABLAS REFERENCIA '!$K$7:$M$63,2,0))","v":1.9},{"$f":"IF('ANEXO INGRESOS'!$C82=\"\",\"\",VLOOKUP('ANEXO INGRESOS'!$C82,'TABLAS REFERENCIA '!$K$7:$M$63,3,FALSE))","v":1},{"$f":"IF(C82=\"\",\"\",'2.PROYECTO'!$F$38*Productividad[[#This Row],[porcentaje parcela cultivado]]*Productividad[[#This Row],[productividad Kg/m2/ciclo ]])","v":0},{"$f":"IF(OR('ANEXO INGRESOS'!$D82=\"\",'ANEXO INGRESOS'!$C82=\"\"),\"\",G82*F82)","v":0},null,null,null,null,null,null,null," "]
[null,null,"Col de Bruselas",0.01,{"$f":"IF('ANEXO INGRESOS'!$C83=\"\",\"\",VLOOKUP('ANEXO INGRESOS'!$C83,'TABLAS REFERENCIA '!$K$7:$M$63,2,0))","v":2.9},{"$f":"IF('ANEXO INGRESOS'!$C83=\"\",\"\",VLOOKUP('ANEXO INGRESOS'!$C83,'TABLAS REFERENCIA '!$K$7:$M$63,3,FALSE))","v":1},{"$f":"IF(C83=\"\",\"\",'2.PROYECTO'!$F$38*Productividad[[#This Row],[porcentaje parcela cultivado]]*Productividad[[#This Row],[productividad Kg/m2/ciclo ]])","v":0},{"$f":"IF(OR('ANEXO INGRESOS'!$D83=\"\",'ANEXO INGRESOS'!$C83=\"\"),\"\",G83*F83)","v":0}]
[null,null,"Espinaca",0.1,{"$f":"IF('ANEXO INGRESOS'!$C84=\"\",\"\",VLOOKUP('ANEXO INGRESOS'!$C84,'TABLAS REFERENCIA '!$K$7:$M$63,2,0))","v":1.9},{"$f":"IF('ANEXO INGRESOS'!$C84=\"\",\"\",VLOOKUP('ANEXO INGRESOS'!$C84,'TABLAS REFERENCIA '!$K$7:$M$63,3,FALSE))","v":2},{"$f":"IF(C84=\"\",\"\",'2.PROYECTO'!$F$38*Productividad[[#This Row],[porcentaje parcela cultivado]]*Productividad[[#This Row],[productividad Kg/m2/ciclo ]])","v":0},{"$f":"IF(OR('ANEXO INGRESOS'!$D84=\"\",'ANEXO INGRESOS'!$C84=\"\"),\"\",G84*F84)","v":0},null,null,null,null,null," "]
[null,null,"Puerro",0.2,{"$f":"IF('ANEXO INGRESOS'!$C85=\"\",\"\",VLOOKUP('ANEXO INGRESOS'!$C85,'TABLAS REFERENCIA '!$K$7:$M$63,2,0))","v":2.8},{"$f":"IF('ANEXO INGRESOS'!$C85=\"\",\"\",VLOOKUP('ANEXO INGRESOS'!$C85,'TABLAS REFERENCIA '!$K$7:$M$63,3,FALSE))","v":1},{"$f":"IF(C85=\"\",\"\",'2.PROYECTO'!$F$38*Productividad[[#This Row],[porcentaje parcela cultivado]]*Productividad[[#This Row],[productividad Kg/m2/ciclo ]])","v":0},{"$f":"IF(OR('ANEXO INGRESOS'!$D85=\"\",'ANEXO INGRESOS'!$C85=\"\"),\"\",G85*F85)","v":0}]
[null,null,"Zanahoria",0.2,{"$f":"IF('ANEXO INGRESOS'!$C86=\"\",\"\",VLOOKUP('ANEXO INGRESOS'!$C86,'TABLAS REFERENCIA '!$K$7:$M$63,2,0))","v":3.2},{"$f":"IF('ANEXO INGRESOS'!$C86=\"\",\"\",VLOOKUP('ANEXO INGRESOS'!$C86,'TABLAS REFERENCIA '!$K$7:$M$63,3,FALSE))","v":2},{"$f":"IF(C86=\"\",\"\",'2.PROYECTO'!$F$38*Productividad[[#This Row],[porcentaje parcela cultivado]]*Productividad[[#This Row],[productividad Kg/m2/ciclo ]])","v":0},{"$f":"IF(OR('ANEXO INGRESOS'!$D86=\"\",'ANEXO INGRESOS'!$C86=\"\"),\"\",G86*F86)","v":0}]
[null,null,null,null,{"$f":"IF('ANEXO INGRESOS'!$C87=\"\",\"\",VLOOKUP('ANEXO INGRESOS'!$C87,'TABLAS REFERENCIA '!$K$7:$M$63,2,0))","v":""},{"$f":"IF('ANEXO INGRESOS'!$C87=\"\",\"\",VLOOKUP('ANEXO INGRESOS'!$C87,'TABLAS REFERENCIA '!$K$7:$M$63,3,FALSE))","v":""},{"$f":"IF(C87=\"\",\"\",'2.PROYECTO'!$F$38*Productividad[[#This Row],[porcentaje parcela cultivado]]*Productividad[[#This Row],[productividad Kg/m2/ciclo ]])","v":""},{"$f":"IF(OR('ANEXO INGRESOS'!$D87=\"\",'ANEXO INGRESOS'!$C87=\"\"),\"\",G87*F87)","v":""}]
[null,null,null,null,null,null,"TOTAL ANUAL kgs ",{"$f":"SUM('ANEXO INGRESOS'!$H$77:$H$87)","v":0}]
[]
[]
[null,null,"Relación entre los productos cultivados y los productos vendidos ",null,null,{"$f":"IF(G93>D93,\"SE CULTIVA MAS DE LO QUE SE VENDE\",\"SE CULTIVA MENOS DE LO QUE SE VENDE\")","v":"SE CULTIVA MENOS DE LO QUE SE VENDE"}]
[null,null,"El total de productos cultivados es mayor o menor que el total de productos vendidos."]
[null,null,"Total kg de productos vendidos",{"$f":"+C186","v":0},null,"Total kg productos cultivados",{"$f":"+H88","v":0}]
[]
[null,null,"1) Si se cultiva menos de lo que se vende: se puede compensar por ejemplo comprando a otros proyectos o bien reducir la estimacion de productos vendidos."]
[null,null,"2) Si se cultiva más de lo que se vende: modifica la estimación de venta o de cultivo (calculadora de productividad). "]
[]
[]
[null,null,"Comentar al cálculo de los ingresos "]
[]
[]
[]
[]
[]
[]
[]
[]
[]
[]
[]
[]
[]
[]
[]
[]
[]
[]
[]
[]
[]
[]
[]
[]
[]
[]
[]
[]
[]
[]
[]
[]
[]
[]
[]
[]
[]
[]
[]
[]
[]
[]
[]
[]
[]
[]
[]
[]
[]
[]
[]
[]
[]
[]
[]
[]
[]
[]
[]
[]
[]
[]
[]
[]
[]
[]
[]
[]
[]
[]
[]
[]
[]
[]
[]
[]
[]
[]
[]
[]
[]
[]
[]
[]
[]
[]
[null,{"$f":"+IF(B14=\"SI \",T14,0)","v":0},{"$f":"+SUM(B186:B295)","v":0}]
[null,0]
[null,0]
[null,0]
[null,0]
[null,0]
[null,0]
[null,0]
[null,0]
[null,0]
[null,0]
[null,0]
[null,0]
[null,0]
[null,0]
[null,0]
[null,0]
[null,{"$f":"+IF(B33=\"SI \",T33,0)","v":0}]
[null,0]
[null,0]
[null,0]
[null,0]
[null,0]
[null,0]
[null,0]
[null,0]
[null,0]
[null,0]
[null,0]
[null,0]
[null,0]
[null,0]
[null,0]
[null,0]
[null,0]
[null,0]

{"sheet":"ANEXO GASTOS FIJOS","index":7,"n_rows":64,"n_cols":18,"rows_kept":64,"cut":false,"hidden":false,"merged":[[7,1,7,3]]}
[]
["Volver al Indice "]
["Volver a gastos fijos "]
[]
[]
[null,"GASTOS FIJOS"]
[]
[null,"INCREMENTO/REDUCCION  DE GASTOS FIJOS INTERANUAL (EN %) ",null,null,"DE AÑO 1 A AÑO 2 ","DE AÑO 2 A AÑO 3 ","DE AÑO 3 A AÑO 4 "]
[]
[]
[null,null,{"$f":"AVERAGE(Prevision_mensual_gastos_fijos[IVA])","v":0.13608695652173913},{"$f":"'7.CUENTA DE RESULTADOS '!C20","v":"1900enero"},{"$f":"'7.CUENTA DE RESULTADOS '!D20","v":"1900enero"},{"$f":"'7.CUENTA DE RESULTADOS '!E20","v":"1900febrero"},{"$f":"'7.CUENTA DE RESULTADOS '!F20","v":"1900marzo"},{"$f":"'7.CUENTA DE RESULTADOS '!G20","v":"1900abril"},{"$f":"'7.CUENTA DE RESULTADOS '!H20","v":"1900mayo"},{"$f":"'7.CUENTA DE RESULTADOS '!I20","v":"1900junio"},{"$f":"'7.CUENTA DE RESULTADOS '!J20","v":"1900julio"},{"$f":"'7.CUENTA DE RESULTADOS '!K20","v":"1900agosto"},{"$f":"'7.CUENTA DE RESULTADOS '!L20","v":"1900septiembre"},{"$f":"'7.CUENTA DE RESULTADOS '!M20","v":"1900octubre"},{"$f":"'7.CUENTA DE RESULTADOS '!N20","v":"1900noviembre"}]
[null,"PREVISIÓN MENSUAL DE GASTOS FIJOS","IVA","Mes 1 ","Mes 2","Mes 3 ","Mes 4 ","Mes 5 ","Mes 6 ","Mes 7 ","Mes 8 ","Mes 9 ","Mes 10 ","Mes 11 ","Mes 12 ","TOTAL anual",null,"TOTAL anual"]
[null,"Amortizaciones",{"$f":"IF('ANEXO GASTOS FIJOS'!$B13=\"\",\"\",VLOOKUP('ANEXO GASTOS FIJOS'!$B13,'TABLAS REFERENCIA '!$H$88:$I$110,2,0))","v":0.21},{"$f":"+'ANEXO INVERSIÓN'!$J$39/12","v":0},{"$f":"+D13","v":0},0,0,0,0,0,0,0,0,0,0,{"$f":"+SUM(D13:O13)","v":0},null,{"$f":"IF(Prevision_mensual_gastos_fijos[[#This Row],[TOTAL anual]]<>0,Prevision_mensual_gastos_fijos[[#This Row],[TOTAL anual]],NA())","v":{"$error":"#N/A"}}]
[null,"Alquileres y cánones",{"$f":"IF('ANEXO GASTOS FIJOS'!$B14=\"\",\"\",VLOOKUP('ANEXO GASTOS FIJOS'!$B14,'TABLAS REFERENCIA '!$H$88:$I$110,2,0))","v":0.21},null,{"$f":"Prevision_mensual_gastos_fijos[[#This Row],[Mes 1 ]]","v":0},{"$f":"Prevision_mensual_gastos_fijos[[#This Row],[Mes 2]]","v":0},{"$f":"Prevision_mensual_gastos_fijos[[#This Row],[Mes 3 ]]","v":0},{"$f":"Prevision_mensual_gastos_fijos[[#This Row],[Mes 4 ]]","v":0},{"$f":"Prevision_mensual_gastos_fijos[[#This Row],[Mes 5 ]]","v":0},{"$f":"Prevision_mensual_gastos_fijos[[#This Row],[Mes 6 ]]","v":0},{"$f":"Prevision_mensual_gastos_fijos[[#This Row],[Mes 7 ]]","v":0},{"$f":"Prevision_mensual_gastos_fijos[[#This Row],[Mes 8 ]]","v":0},{"$f":"Prevision_mensual_gastos_fijos[[#This Row],[Mes 9 ]]","v":0},{"$f":"Prevision_mensual_gastos_fijos[[#This Row],[Mes 10 ]]","v":0},{"$f":"Prevision_mensual_gastos_fijos[[#This Row],[Mes 11 ]]","v":0},0,null,{"$f":"IF(Prevision_mensual_gastos_fijos[[#This Row],[TOTAL anual]]<>0,Prevision_mensual_gastos_fijos[[#This Row],[TOTAL anual]],NA())","v":{"$error":"#N/A"}}]
[null,"Renting",{"$f":"IF('ANEXO GASTOS FIJOS'!$B15=\"\",\"\",VLOOKUP('ANEXO GASTOS FIJOS'!$B15,'TABLAS REFERENCIA '!$H$88:$I$110,2,0))","v":0.21},null,{"$f":"Prevision_mensual_gastos_fijos[[#This Row],[Mes 1 ]]","v":0},{"$f":"Prevision_mensual_gastos_fijos[[#This Row],[Mes 2]]","v":0},{"$f":"Prevision_mensual_gastos_fijos[[#This Row],[Mes 3 ]]","v":0},{"$f":"Prevision_mensual_gastos_fijos[[#This Row],[Mes 4 ]]","v":0},{"$f":"Prevision_mensual_gastos_fijos[[#This Row],[Mes 5 ]]","v":0},{"$f":"Prevision_mensual_gastos_fijos[[#This Row],[Mes 6 ]]","v":0},{"$f":"Prevision_mensual_gastos_fijos[[#This Row],[Mes 7 ]]","v":0},{"$f":"Prevision_mensual_gastos_fijos[[#This Row],[Mes 8 ]]","v":0},{"$f":"Prevision_mensual_gastos_fijos[[#This Row],[Mes 9 ]]","v":0},{"$f":"Prevision_mensual_gastos_fijos[[#This Row],[Mes 10 ]]","v":0},{"$f":"Prevision_mensual_gastos_fijos[[#This Row],[Mes 11 ]]","v":0},0,null,{"$f":"IF(Prevision_mensual_gastos_fijos[[#This Row],[TOTAL anual]]<>0,Prevision_mensual_gastos_fijos[[#This Row],[TOTAL anual]],NA())","v":{"$error":"#N/A"}}]
[null,"Conservación (Mantenimiento y reparaciones)",{"$f":"IF('ANEXO GASTOS FIJOS'!$B16=\"\",\"\",VLOOKUP('ANEXO GASTOS FIJOS'!$B16,'TABLAS REFERENCIA '!$H$88:$I$110,2,0))","v":0.21},null,{"$f":"Prevision_mensual_gastos_fijos[[#This Row],[Mes 1 ]]","v":0},{"$f":"Prevision_mensual_gastos_fijos[[#This Row],[Mes 2]]","v":0},{"$f":"Prevision_mensual_gastos_fijos[[#This Row],[Mes 3 ]]","v":0},{"$f":"Prevision_mensual_gastos_fijos[[#This Row],[Mes 4 ]]","v":0},{"$f":"Prevision_mensual_gastos_fijos[[#This Row],[Mes 5 ]]","v":0},{"$f":"Prevision_mensual_gastos_fijos[[#This Row],[Mes 6 ]]","v":0},{"$f":"Prevision_mensual_gastos_fijos[[#This Row],[Mes 7 ]]","v":0},{"$f":"Prevision_mensual_gastos_fijos[[#This Row],[Mes 8 ]]","v":0},{"$f":"Prevision_mensual_gastos_fijos[[#This Row],[Mes 9 ]]","v":0},{"$f":"Prevision_mensual_gastos_fijos[[#This Row],[Mes 10 ]]","v":0},{"$f":"Prevision_mensual_gastos_fijos[[#This Row],[Mes 11 ]]","v":0},0,null,{"$f":"IF(Prevision_mensual_gastos_fijos[[#This Row],[TOTAL anual]]<>0,Prevision_mensual_gastos_fijos[[#This Row],[TOTAL anual]],NA())","v":{"$error":"#N/A"}}]
[null,"Servicios profesionales",{"$f":"IF('ANEXO GASTOS FIJOS'!$B17=\"\",\"\",VLOOKUP('ANEXO GASTOS FIJOS'!$B17,'TABLAS REFERENCIA '!$H$88:$I$110,2,0))","v":0.21},null,{"$f":"Prevision_mensual_gastos_fijos[[#This Row],[Mes 1 ]]","v":0},{"$f":"Prevision_mensual_gastos_fijos[[#This Row],[Mes 2]]","v":0},{"$f":"Prevision_mensual_gastos_fijos[[#This Row],[Mes 3 ]]","v":0},{"$f":"Prevision_mensual_gastos_fijos[[#This Row],[Mes 4 ]]","v":0},{"$f":"Prevision_mensual_gastos_fijos[[#This Row],[Mes 5 ]]","v":0},{"$f":"Prevision_mensual_gastos_fijos[[#This Row],[Mes 6 ]]","v":0},{"$f":"Prevision_mensual_gastos_fijos[[#This Row],[Mes 7 ]]","v":0},{"$f":"Prevision_mensual_gastos_fijos[[#This Row],[Mes 8 ]]","v":0},{"$f":"Prevision_mensual_gastos_fijos[[#This Row],[Mes 9 ]]","v":0},{"$f":"Prevision_mensual_gastos_fijos[[#This Row],[Mes 10 ]]","v":0},{"$f":"Prevision_mensual_gastos_fijos[[#This Row],[Mes 11 ]]","v":0},{"$f":"+SUM(D17:O17)","v":0},null,{"$f":"IF(Prevision_mensual_gastos_fijos[[#This Row],[TOTAL anual]]<>0,Prevision_mensual_gastos_fijos[[#This Row],[TOTAL anual]],NA())","v":{"$error":"#N/A"}}]
[null,"Transporte",{"$f":"IF('ANEXO GASTOS FIJOS'!$B18=\"\",\"\",VLOOKUP('ANEXO GASTOS FIJOS'!$B18,'TABLAS REFERENCIA '!$H$88:$I$110,2,0))","v":0.21},null,{"$f":"Prevision_mensual_gastos_fijos[[#This Row],[Mes 1 ]]","v":0},{"$f":"Prevision_mensual_gastos_fijos[[#This Row],[Mes 2]]","v":0},{"$f":"Prevision_mensual_gastos_fijos[[#This Row],[Mes 3 ]]","v":0},{"$f":"Prevision_mensual_gastos_fijos[[#This Row],[Mes 4 ]]","v":0},{"$f":"Prevision_mensual_gastos_fijos[[#This Row],[Mes 5 ]]","v":0},{"$f":"Prevision_mensual_gastos_fijos[[#This Row],[Mes 6 ]]","v":0},{"$f":"Prevision_mensual_gastos_fijos[[#This Row],[Mes 7 ]]","v":0},{"$f":"Prevision_mensual_gastos_fijos[[#This Row],[Mes 8 ]]","v":0},{"$f":"Prevision_mensual_gastos_fijos[[#This Row],[Mes 9 ]]","v":0},{"$f":"Prevision_mensual_gastos_fijos[[#This Row],[Mes 10 ]]","v":0},{"$f":"Prevision_mensual_gastos_fijos[[#This Row],[Mes 11 ]]","v":0},0,null,{"$f":"IF(Prevision_mensual_gastos_fijos[[#This Row],[TOTAL anual]]<>0,Prevision_mensual_gastos_fijos[[#This Row],[TOTAL anual]],NA())","v":{"$error":"#N/A"}}]
[null,"Seguros",{"$f":"IF('ANEXO GASTOS FIJOS'!$B19=\"\",\"\",VLOOKUP('ANEXO GASTOS FIJOS'!$B19,'TABLAS REFERENCIA '!$H$88:$I$110,2,0))","v":0},null,{"$f":"Prevision_mensual_gastos_fijos[[#This Row],[Mes 1 ]]","v":0},{"$f":"Prevision_mensual_gastos_fijos[[#This Row],[Mes 2]]","v":0},{"$f":"Prevision_mensual_gastos_fijos[[#This Row],[Mes 3 ]]","v":0},{"$f":"Prevision_mensual_gastos_fijos[[#This Row],[Mes 4 ]]","v":0},{"$f":"Prevision_mensual_gastos_fijos[[#This Row],[Mes 5 ]]","v":0},{"$f":"Prevision_mensual_gastos_fijos[[#This Row],[Mes 6 ]]","v":0},{"$f":"Prevision_mensual_gastos_fijos[[#This Row],[Mes 7 ]]","v":0},{"$f":"Prevision_mensual_gastos_fijos[[#This Row],[Mes 8 ]]","v":0},{"$f":"Prevision_mensual_gastos_fijos[[#This Row],[Mes 9 ]]","v":0},{"$f":"Prevision_mensual_gastos_fijos[[#This Row],[Mes 10 ]]","v":0},{"$f":"Prevision_mensual_gastos_fijos[[#This Row],[Mes 11 ]]","v":0},{"$f":"+SUM(D19:O19)","v":0},null,{"$f":"IF(Prevision_mensual_gastos_fijos[[#This Row],[TOTAL anual]]<>0,Prevision_mensual_gastos_fijos[[#This Row],[TOTAL anual]],NA())","v":{"$error":"#N/A"}}]
[null,"Gastos bancarios",{"$f":"IF('ANEXO GASTOS FIJOS'!$B20=\"\",\"\",VLOOKUP('ANEXO GASTOS FIJOS'!$B20,'TABLAS REFERENCIA '!$H$88:$I$110,2,0))","v":0.21},null,{"$f":"Prevision_mensual_gastos_fijos[[#This Row],[Mes 1 ]]","v":0},{"$f":"Prevision_mensual_gastos_fijos[[#This Row],[Mes 2]]","v":0},{"$f":"Prevision_mensual_gastos_fijos[[#This Row],[Mes 3 ]]","v":0},{"$f":"Prevision_mensual_gastos_fijos[[#This Row],[Mes 4 ]]","v":0},{"$f":"Prevision_mensual_gastos_fijos[[#This Row],[Mes 5 ]]","v":0},{"$f":"Prevision_mensual_gastos_fijos[[#This Row],[Mes 6 ]]","v":0},{"$f":"Prevision_mensual_gastos_fijos[[#This Row],[Mes 7 ]]","v":0},{"$f":"Prevision_mensual_gastos_fijos[[#This Row],[Mes 8 ]]","v":0},{"$f":"Prevision_mensual_gastos_fijos[[#This Row],[Mes 9 ]]","v":0},{"$f":"Prevision_mensual_gastos_fijos[[#This Row],[Mes 10 ]]","v":0},{"$f":"Prevision_mensual_gastos_fijos[[#This Row],[Mes 11 ]]","v":0},0,null,{"$f":"IF(Prevision_mensual_gastos_fijos[[#This Row],[TOTAL anual]]<>0,Prevision_mensual_gastos_fijos[[#This Row],[TOTAL anual]],NA())","v":{"$error":"#N/A"}}]
[null,"Publicidad y comunicación",{"$f":"IF('ANEXO GASTOS FIJOS'!$B21=\"\",\"\",VLOOKUP('ANEXO GASTOS FIJOS'!$B21,'TABLAS REFERENCIA '!$H$88:$I$110,2,0))","v":0.21},null,{"$f":"Prevision_mensual_gastos_fijos[[#This Row],[Mes 1 ]]","v":0},{"$f":"Prevision_mensual_gastos_fijos[[#This Row],[Mes 2]]","v":0},{"$f":"Prevision_mensual_gastos_fijos[[#This Row],[Mes 3 ]]","v":0},{"$f":"Prevision_mensual_gastos_fijos[[#This Row],[Mes 4 ]]","v":0},{"$f":"Prevision_mensual_gastos_fijos[[#This Row],[Mes 5 ]]","v":0},{"$f":"Prevision_mensual_gastos_fijos[[#This Row],[Mes 6 ]]","v":0},{"$f":"Prevision_mensual_gastos_fijos[[#This Row],[Mes 7 ]]","v":0},{"$f":"Prevision_mensual_gastos_fijos[[#This Row],[Mes 8 ]]","v":0},{"$f":"Prevision_mensual_gastos_fijos[[#This Row],[Mes 9 ]]","v":0},{"$f":"Prevision_mensual_gastos_fijos[[#This Row],[Mes 10 ]]","v":0},{"$f":"Prevision_mensual_gastos_fijos[[#This Row],[Mes 11 ]]","v":0},0,null,{"$f":"IF(Prevision_mensual_gastos_fijos[[#This Row],[TOTAL anual]]<>0,Prevision_mensual_gastos_fijos[[#This Row],[TOTAL anual]],NA())","v":{"$error":"#N/A"}}]
[null,"Electricidad",{"$f":"IF('ANEXO GASTOS FIJOS'!$B22=\"\",\"\",VLOOKUP('ANEXO GASTOS FIJOS'!$B22,'TABLAS REFERENCIA '!$H$88:$I$110,2,0))","v":0.1},null,{"$f":"Prevision_mensual_gastos_fijos[[#This Row],[Mes 1 ]]","v":0},{"$f":"Prevision_mensual_gastos_fijos[[#This Row],[Mes 2]]","v":0},{"$f":"Prevision_mensual_gastos_fijos[[#This Row],[Mes 3 ]]","v":0},{"$f":"Prevision_mensual_gastos_fijos[[#This Row],[Mes 4 ]]","v":0},{"$f":"Prevision_mensual_gastos_fijos[[#This Row],[Mes 5 ]]","v":0},{"$f":"Prevision_mensual_gastos_fijos[[#This Row],[Mes 6 ]]","v":0},{"$f":"Prevision_mensual_gastos_fijos[[#This Row],[Mes 7 ]]","v":0},{"$f":"Prevision_mensual_gastos_fijos[[#This Row],[Mes 8 ]]","v":0},{"$f":"Prevision_mensual_gastos_fijos[[#This Row],[Mes 9 ]]","v":0},{"$f":"Prevision_mensual_gastos_fijos[[#This Row],[Mes 10 ]]","v":0},{"$f":"Prevision_mensual_gastos_fijos[[#This Row],[Mes 11 ]]","v":0},0,null,{"$f":"IF(Prevision_mensual_gastos_fijos[[#This Row],[TOTAL anual]]<>0,Prevision_mensual_gastos_fijos[[#This Row],[TOTAL anual]],NA())","v":{"$error":"#N/A"}}]
[null,"Consumo de agua",{"$f":"IF('ANEXO GASTOS FIJOS'!$B23=\"\",\"\",VLOOKUP('ANEXO GASTOS FIJOS'!$B23,'TABLAS REFERENCIA '!$H$88:$I$110,2,0))","v":0.1},{"$f":"+G60/12","v":0},{"$f":"+Prevision_mensual_gastos_fijos[[#This Row],[Mes 1 ]]","v":0},{"$f":"+Prevision_mensual_gastos_fijos[[#This Row],[Mes 1 ]]","v":0},{"$f":"+Prevision_mensual_gastos_fijos[[#This Row],[Mes 1 ]]","v":0},{"$f":"+Prevision_mensual_gastos_fijos[[#This Row],[Mes 1 ]]","v":0},{"$f":"+Prevision_mensual_gastos_fijos[[#This Row],[Mes 1 ]]","v":0},{"$f":"+Prevision_mensual_gastos_fijos[[#This Row],[Mes 1 ]]","v":0},{"$f":"+Prevision_mensual_gastos_fijos[[#This Row],[Mes 1 ]]","v":0},{"$f":"+Prevision_mensual_gastos_fijos[[#This Row],[Mes 1 ]]","v":0},{"$f":"+Prevision_mensual_gastos_fijos[[#This Row],[Mes 1 ]]","v":0},{"$f":"+Prevision_mensual_gastos_fijos[[#This Row],[Mes 1 ]]","v":0},{"$f":"+Prevision_mensual_gastos_fijos[[#This Row],[Mes 1 ]]","v":0},0,null,{"$f":"IF(Prevision_mensual_gastos_fijos[[#This Row],[TOTAL anual]]<>0,Prevision_mensual_gastos_fijos[[#This Row],[TOTAL anual]],NA())","v":{"$error":"#N/A"}}]
[null,"Telefonia Movil / Fija",{"$f":"IF('ANEXO GASTOS FIJOS'!$B24=\"\",\"\",VLOOKUP('ANEXO GASTOS FIJOS'!$B24,'TABLAS REFERENCIA '!$H$88:$I$110,2,0))","v":0.21},null,{"$f":"Prevision_mensual_gastos_fijos[[#This Row],[Mes 1 ]]","v":0},{"$f":"Prevision_mensual_gastos_fijos[[#This Row],[Mes 2]]","v":0},{"$f":"Prevision_mensual_gastos_fijos[[#This Row],[Mes 3 ]]","v":0},{"$f":"Prevision_mensual_gastos_fijos[[#This Row],[Mes 4 ]]","v":0},{"$f":"Prevision_mensual_gastos_fijos[[#This Row],[Mes 5 ]]","v":0},{"$f":"Prevision_mensual_gastos_fijos[[#This Row],[Mes 6 ]]","v":0},{"$f":"Prevision_mensual_gastos_fijos[[#This Row],[Mes 7 ]]","v":0},{"$f":"Prevision_mensual_gastos_fijos[[#This Row],[Mes 8 ]]","v":0},{"$f":"Prevision_mensual_gastos_fijos[[#This Row],[Mes 9 ]]","v":0},{"$f":"Prevision_mensual_gastos_fijos[[#This Row],[Mes 10 ]]","v":0},{"$f":"Prevision_mensual_gastos_fijos[[#This Row],[Mes 11 ]]","v":0},0,null,{"$f":"IF(Prevision_mensual_gastos_fijos[[#This Row],[TOTAL anual]]<>0,Prevision_mensual_gastos_fijos[[#This Row],[TOTAL anual]],NA())","v":{"$error":"#N/A"}}]
[null,"Internet",{"$f":"IF('ANEXO GASTOS FIJOS'!$B25=\"\",\"\",VLOOKUP('ANEXO GASTOS FIJOS'!$B25,'TABLAS REFERENCIA '!$H$88:$I$110,2,0))","v":0.21},null,{"$f":"Prevision_mensual_gastos_fijos[[#This Row],[Mes 1 ]]","v":0},{"$f":"Prevision_mensual_gastos_fijos[[#This Row],[Mes 2]]","v":0},{"$f":"Prevision_mensual_gastos_fijos[[#This Row],[Mes 3 ]]","v":0},{"$f":"Prevision_mensual_gastos_fijos[[#This Row],[Mes 4 ]]","v":0},{"$f":"Prevision_mensual_gastos_fijos[[#This Row],[Mes 5 ]]","v":0},{"$f":"Prevision_mensual_gastos_fijos[[#This Row],[Mes 6 ]]","v":0},{"$f":"Prevision_mensual_gastos_fijos[[#This Row],[Mes 7 ]]","v":0},{"$f":"Prevision_mensual_gastos_fijos[[#This Row],[Mes 8 ]]","v":0},{"$f":"Prevision_mensual_gastos_fijos[[#This Row],[Mes 9 ]]","v":0},{"$f":"Prevision_mensual_gastos_fijos[[#This Row],[Mes 10 ]]","v":0},{"$f":"Prevision_mensual_gastos_fijos[[#This Row],[Mes 11 ]]","v":0},0,null,{"$f":"IF(Prevision_mensual_gastos_fijos[[#This Row],[TOTAL anual]]<>0,Prevision_mensual_gastos_fijos[[#This Row],[TOTAL anual]],NA())","v":{"$error":"#N/A"}}]
[null,"Material de Oficina",{"$f":"IF('ANEXO GASTOS FIJOS'!$B26=\"\",\"\",VLOOKUP('ANEXO GASTOS FIJOS'!$B26,'TABLAS REFERENCIA '!$H$88:$I$110,2,0))","v":0.21},null,{"$f":"Prevision_mensual_gastos_fijos[[#This Row],[Mes 1 ]]","v":0},{"$f":"Prevision_mensual_gastos_fijos[[#This Row],[Mes 2]]","v":0},{"$f":"Prevision_mensual_gastos_fijos[[#This Row],[Mes 3 ]]","v":0},{"$f":"Prevision_mensual_gastos_fijos[[#This Row],[Mes 4 ]]","v":0},{"$f":"Prevision_mensual_gastos_fijos[[#This Row],[Mes 5 ]]","v":0},{"$f":"Prevision_mensual_gastos_fijos[[#This Row],[Mes 6 ]]","v":0},{"$f":"Prevision_mensual_gastos_fijos[[#This Row],[Mes 7 ]]","v":0},{"$f":"Prevision_mensual_gastos_fijos[[#This Row],[Mes 8 ]]","v":0},{"$f":"Prevision_mensual_gastos_fijos[[#This Row],[Mes 9 ]]","v":0},{"$f":"Prevision_mensual_gastos_fijos[[#This Row],[Mes 10 ]]","v":0},{"$f":"Prevision_mensual_gastos_fijos[[#This Row],[Mes 11 ]]","v":0},0,null,{"$f":"IF(Prevision_mensual_gastos_fijos[[#This Row],[TOTAL anual]]<>0,Prevision_mensual_gastos_fijos[[#This Row],[TOTAL anual]],NA())","v":{"$error":"#N/A"}}]
[null,"Sueldo bruto de los trabajadores autónomos",{"$f":"IF('ANEXO GASTOS FIJOS'!$B27=\"\",\"\",VLOOKUP('ANEXO GASTOS FIJOS'!$B27,'TABLAS REFERENCIA '!$H$88:$I$110,2,0))","v":0},null,{"$f":"Prevision_mensual_gastos_fijos[[#This Row],[Mes 1 ]]","v":0},{"$f":"Prevision_mensual_gastos_fijos[[#This Row],[Mes 2]]","v":0},{"$f":"Prevision_mensual_gastos_fijos[[#This Row],[Mes 3 ]]","v":0},{"$f":"Prevision_mensual_gastos_fijos[[#This Row],[Mes 4 ]]","v":0},{"$f":"Prevision_mensual_gastos_fijos[[#This Row],[Mes 5 ]]","v":0},{"$f":"Prevision_mensual_gastos_fijos[[#This Row],[Mes 6 ]]","v":0},{"$f":"Prevision_mensual_gastos_fijos[[#This Row],[Mes 7 ]]","v":0},{"$f":"Prevision_mensual_gastos_fijos[[#This Row],[Mes 8 ]]","v":0},{"$f":"Prevision_mensual_gastos_fijos[[#This Row],[Mes 9 ]]","v":0},{"$f":"Prevision_mensual_gastos_fijos[[#This Row],[Mes 10 ]]","v":0},{"$f":"Prevision_mensual_gastos_fijos[[#This Row],[Mes 11 ]]","v":0},0,null,{"$f":"IF(Prevision_mensual_gastos_fijos[[#This Row],[TOTAL anual]]<>0,Prevision_mensual_gastos_fijos[[#This Row],[TOTAL anual]],NA())","v":{"$error":"#N/A"}}]
[null,"Cotización a la Seguridad Social de los trabajadores autónomos",{"$f":"IF('ANEXO GASTOS FIJOS'!$B28=\"\",\"\",VLOOKUP('ANEXO GASTOS FIJOS'!$B28,'TABLAS REFERENCIA '!$H$88:$I$110,2,0))","v":0},null,{"$f":"Prevision_mensual_gastos_fijos[[#This Row],[Mes 1 ]]","v":0},{"$f":"Prevision_mensual_gastos_fijos[[#This Row],[Mes 2]]","v":0},{"$f":"Prevision_mensual_gastos_fijos[[#This Row],[Mes 3 ]]","v":0},{"$f":"Prevision_mensual_gastos_fijos[[#This Row],[Mes 4 ]]","v":0},{"$f":"Prevision_mensual_gastos_fijos[[#This Row],[Mes 5 ]]","v":0},{"$f":"Prevision_mensual_gastos_fijos[[#This Row],[Mes 6 ]]","v":0},{"$f":"Prevision_mensual_gastos_fijos[[#This Row],[Mes 7 ]]","v":0},{"$f":"Prevision_mensual_gastos_fijos[[#This Row],[Mes 8 ]]","v":0},{"$f":"Prevision_mensual_gastos_fijos[[#This Row],[Mes 9 ]]","v":0},{"$f":"Prevision_mensual_gastos_fijos[[#This Row],[Mes 10 ]]","v":0},{"$f":"Prevision_mensual_gastos_fijos[[#This Row],[Mes 11 ]]","v":0},0,null,{"$f":"IF(Prevision_mensual_gastos_fijos[[#This Row],[TOTAL anual]]<>0,Prevision_mensual_gastos_fijos[[#This Row],[TOTAL anual]],NA())","v":{"$error":"#N/A"}}]
[null,"Sueldo bruto de los trabajadores en régimen general",{"$f":"IF('ANEXO GASTOS FIJOS'!$B29=\"\",\"\",VLOOKUP('ANEXO GASTOS FIJOS'!$B29,'TABLAS REFERENCIA '!$H$88:$I$110,2,0))","v":0},null,{"$f":"Prevision_mensual_gastos_fijos[[#This Row],[Mes 1 ]]","v":0},{"$f":"Prevision_mensual_gastos_fijos[[#This Row],[Mes 2]]","v":0},{"$f":"Prevision_mensual_gastos_fijos[[#This Row],[Mes 3 ]]","v":0},{"$f":"Prevision_mensual_gastos_fijos[[#This Row],[Mes 4 ]]","v":0},{"$f":"Prevision_mensual_gastos_fijos[[#This Row],[Mes 5 ]]","v":0},{"$f":"Prevision_mensual_gastos_fijos[[#This Row],[Mes 6 ]]","v":0},{"$f":"Prevision_mensual_gastos_fijos[[#This Row],[Mes 7 ]]","v":0},{"$f":"Prevision_mensual_gastos_fijos[[#This Row],[Mes 8 ]]","v":0},{"$f":"Prevision_mensual_gastos_fijos[[#This Row],[Mes 9 ]]","v":0},{"$f":"Prevision_mensual_gastos_fijos[[#This Row],[Mes 10 ]]","v":0},{"$f":"Prevision_mensual_gastos_fijos[[#This Row],[Mes 11 ]]","v":0},{"$f":"+SUM(D29:O29)","v":0},null,{"$f":"IF(Prevision_mensual_gastos_fijos[[#This Row],[TOTAL anual]]<>0,Prevision_mensual_gastos_fijos[[#This Row],[TOTAL anual]],NA())","v":{"$error":"#N/A"}}]
[null,"Cotización a la Seguridad Social de los trabajadores en régimen general",{"$f":"IF('ANEXO GASTOS FIJOS'!$B30=\"\",\"\",VLOOKUP('ANEXO GASTOS FIJOS'!$B30,'TABLAS REFERENCIA '!$H$88:$I$110,2,0))","v":0},null,{"$f":"Prevision_mensual_gastos_fijos[[#This Row],[Mes 1 ]]","v":0},{"$f":"Prevision_mensual_gastos_fijos[[#This Row],[Mes 2]]","v":0},{"$f":"Prevision_mensual_gastos_fijos[[#This Row],[Mes 3 ]]","v":0},{"$f":"Prevision_mensual_gastos_fijos[[#This Row],[Mes 4 ]]","v":0},{"$f":"Prevision_mensual_gastos_fijos[[#This Row],[Mes 5 ]]","v":0},{"$f":"Prevision_mensual_gastos_fijos[[#This Row],[Mes 6 ]]","v":0},{"$f":"Prevision_mensual_gastos_fijos[[#This Row],[Mes 7 ]]","v":0},{"$f":"Prevision_mensual_gastos_fijos[[#This Row],[Mes 8 ]]","v":0},{"$f":"Prevision_mensual_gastos_fijos[[#This Row],[Mes 9 ]]","v":0},{"$f":"Prevision_mensual_gastos_fijos[[#This Row],[Mes 10 ]]","v":0},{"$f":"Prevision_mensual_gastos_fijos[[#This Row],[Mes 11 ]]","v":0},0,null,{"$f":"IF(Prevision_mensual_gastos_fijos[[#This Row],[TOTAL anual]]<>0,Prevision_mensual_gastos_fijos[[#This Row],[TOTAL anual]],NA())","v":{"$error":"#N/A"}}]
[null,"Retenciones IRPF",{"$f":"IF('ANEXO GASTOS FIJOS'!$B31=\"\",\"\",VLOOKUP('ANEXO GASTOS FIJOS'!$B31,'TABLAS REFERENCIA '!$H$88:$I$110,2,0))","v":0},null,{"$f":"Prevision_mensual_gastos_fijos[[#This Row],[Mes 1 ]]","v":0},{"$f":"Prevision_mensual_gastos_fijos[[#This Row],[Mes 2]]","v":0},{"$f":"Prevision_mensual_gastos_fijos[[#This Row],[Mes 3 ]]","v":0},{"$f":"Prevision_mensual_gastos_fijos[[#This Row],[Mes 4 ]]","v":0},{"$f":"Prevision_mensual_gastos_fijos[[#This Row],[Mes 5 ]]","v":0},{"$f":"Prevision_mensual_gastos_fijos[[#This Row],[Mes 6 ]]","v":0},{"$f":"Prevision_mensual_gastos_fijos[[#This Row],[Mes 7 ]]","v":0},{"$f":"Prevision_mensual_gastos_fijos[[#This Row],[Mes 8 ]]","v":0},{"$f":"Prevision_mensual_gastos_fijos[[#This Row],[Mes 9 ]]","v":0},{"$f":"Prevision_mensual_gastos_fijos[[#This Row],[Mes 10 ]]","v":0},{"$f":"Prevision_mensual_gastos_fijos[[#This Row],[Mes 11 ]]","v":0},0,null,{"$f":"IF(Prevision_mensual_gastos_fijos[[#This Row],[TOTAL anual]]<>0,Prevision_mensual_gastos_fijos[[#This Row],[TOTAL anual]],NA())","v":{"$error":"#N/A"}}]
[null,"Mantenimiento del riego ",{"$f":"IF('ANEXO GASTOS FIJOS'!$B32=\"\",\"\",VLOOKUP('ANEXO GASTOS FIJOS'!$B32,'TABLAS REFERENCIA '!$H$88:$I$110,2,0))","v":0.21},{"$f":"+G59/12","v":0},0,{"$f":"Prevision_mensual_gastos_fijos[[#This Row],[Mes 2]]","v":0},{"$f":"Prevision_mensual_gastos_fijos[[#This Row],[Mes 3 ]]","v":0},{"$f":"Prevision_mensual_gastos_fijos[[#This Row],[Mes 4 ]]","v":0},{"$f":"Prevision_mensual_gastos_fijos[[#This Row],[Mes 5 ]]","v":0},{"$f":"Prevision_mensual_gastos_fijos[[#This Row],[Mes 6 ]]","v":0},{"$f":"Prevision_mensual_gastos_fijos[[#This Row],[Mes 7 ]]","v":0},{"$f":"Prevision_mensual_gastos_fijos[[#This Row],[Mes 8 ]]","v":0},{"$f":"Prevision_mensual_gastos_fijos[[#This Row],[Mes 9 ]]","v":0},{"$f":"Prevision_mensual_gastos_fijos[[#This Row],[Mes 10 ]]","v":0},{"$f":"Prevision_mensual_gastos_fijos[[#This Row],[Mes 11 ]]","v":0},0,null,{"$f":"IF(Prevision_mensual_gastos_fijos[[#This Row],[TOTAL anual]]<>0,Prevision_mensual_gastos_fijos[[#This Row],[TOTAL anual]],NA())","v":{"$error":"#N/A"}}]
[null,"Plantel ",{"$f":"IF('ANEXO GASTOS FIJOS'!$B33=\"\",\"\",VLOOKUP('ANEXO GASTOS FIJOS'!$B33,'TABLAS REFERENCIA '!$H$88:$I$110,2,0))","v":0.1},{"$f":"+G61/12","v":0},0,{"$f":"Prevision_mensual_gastos_fijos[[#This Row],[Mes 2]]","v":0},{"$f":"Prevision_mensual_gastos_fijos[[#This Row],[Mes 3 ]]","v":0},{"$f":"Prevision_mensual_gastos_fijos[[#This Row],[Mes 4 ]]","v":0},{"$f":"Prevision_mensual_gastos_fijos[[#This Row],[Mes 5 ]]","v":0},{"$f":"Prevision_mensual_gastos_fijos[[#This Row],[Mes 6 ]]","v":0},{"$f":"Prevision_mensual_gastos_fijos[[#This Row],[Mes 7 ]]","v":0},{"$f":"Prevision_mensual_gastos_fijos[[#This Row],[Mes 8 ]]","v":0},{"$f":"Prevision_mensual_gastos_fijos[[#This Row],[Mes 9 ]]","v":0},{"$f":"Prevision_mensual_gastos_fijos[[#This Row],[Mes 10 ]]","v":0},{"$f":"Prevision_mensual_gastos_fijos[[#This Row],[Mes 11 ]]","v":0},0,null,{"$f":"IF(Prevision_mensual_gastos_fijos[[#This Row],[TOTAL anual]]<>0,Prevision_mensual_gastos_fijos[[#This Row],[TOTAL anual]],NA())","v":{"$error":"#N/A"}}]
[null,"Fitosanitarios ",{"$f":"IF('ANEXO GASTOS FIJOS'!$B34=\"\",\"\",VLOOKUP('ANEXO GASTOS FIJOS'!$B34,'TABLAS REFERENCIA '!$H$88:$I$110,2,0))","v":0.1},{"$f":"+G62/12","v":0},0,{"$f":"Prevision_mensual_gastos_fijos[[#This Row],[Mes 2]]","v":0},{"$f":"Prevision_mensual_gastos_fijos[[#This Row],[Mes 3 ]]","v":0},{"$f":"Prevision_mensual_gastos_fijos[[#This Row],[Mes 4 ]]","v":0},{"$f":"Prevision_mensual_gastos_fijos[[#This Row],[Mes 5 ]]","v":0},{"$f":"Prevision_mensual_gastos_fijos[[#This Row],[Mes 6 ]]","v":0},{"$f":"Prevision_mensual_gastos_fijos[[#This Row],[Mes 7 ]]","v":0},{"$f":"Prevision_mensual_gastos_fijos[[#This Row],[Mes 8 ]]","v":0},{"$f":"Prevision_mensual_gastos_fijos[[#This Row],[Mes 9 ]]","v":0},{"$f":"Prevision_mensual_gastos_fijos[[#This Row],[Mes 10 ]]","v":0},{"$f":"Prevision_mensual_gastos_fijos[[#This Row],[Mes 11 ]]","v":0},0,null,{"$f":"IF(Prevision_mensual_gastos_fijos[[#This Row],[TOTAL anual]]<>0,Prevision_mensual_gastos_fijos[[#This Row],[TOTAL anual]],NA())","v":{"$error":"#N/A"}}]
[null,"Fertilizantes ",{"$f":"IF('ANEXO GASTOS FIJOS'!$B35=\"\",\"\",VLOOKUP('ANEXO GASTOS FIJOS'!$B35,'TABLAS REFERENCIA '!$H$88:$I$110,2,0))","v":0.21},{"$f":"+G63/12","v":0},0,{"$f":"Prevision_mensual_gastos_fijos[[#This Row],[Mes 2]]","v":0},{"$f":"Prevision_mensual_gastos_fijos[[#This Row],[Mes 3 ]]","v":0},{"$f":"Prevision_mensual_gastos_fijos[[#This Row],[Mes 4 ]]","v":0},{"$f":"Prevision_mensual_gastos_fijos[[#This Row],[Mes 5 ]]","v":0},{"$f":"Prevision_mensual_gastos_fijos[[#This Row],[Mes 6 ]]","v":0},{"$f":"Prevision_mensual_gastos_fijos[[#This Row],[Mes 7 ]]","v":0},{"$f":"Prevision_mensual_gastos_fijos[[#This Row],[Mes 8 ]]","v":0},{"$f":"Prevision_mensual_gastos_fijos[[#This Row],[Mes 9 ]]","v":0},{"$f":"Prevision_mensual_gastos_fijos[[#This Row],[Mes 10 ]]","v":0},{"$f":"Prevision_mensual_gastos_fijos[[#This Row],[Mes 11 ]]","v":0},0,null,{"$f":"IF(Prevision_mensual_gastos_fijos[[#This Row],[TOTAL anual]]<>0,Prevision_mensual_gastos_fijos[[#This Row],[TOTAL anual]],NA())","v":{"$error":"#N/A"}}]
[null,null,null,null,null,null,null,null,null,null,null,null,null,null,null,0,null,{"$f":"IF(Prevision_mensual_gastos_fijos[[#This Row],[TOTAL anual]]<>0,Prevision_mensual_gastos_fijos[[#This Row],[TOTAL anual]],NA())","v":{"$error":"#N/A"}}]
[null,null,null,null,null,null,null,null,null,null,null,null,null,null,null,0,null,{"$f":"IF(Prevision_mensual_gastos_fijos[[#This Row],[TOTAL anual]]<>0,Prevision_mensual_gastos_fijos[[#This Row],[TOTAL anual]],NA())","v":{"$error":"#N/A"}}]
[null,null,{"$f":"IF('ANEXO GASTOS FIJOS'!$B38=\"\",\"\",VLOOKUP('ANEXO GASTOS FIJOS'!$B38,'TABLAS REFERENCIA '!$H$42:$I$49,2,1))","v":""},null,null,null,null,null,null,null,null,null,null,null,null,0,null,{"$f":"IF(Prevision_mensual_gastos_fijos[[#This Row],[TOTAL anual]]<>0,Prevision_mensual_gastos_fijos[[#This Row],[TOTAL anual]],NA())","v":{"$error":"#N/A"}}]
[]
[]
[null,"iva promedio "]
[null,"Total Base Gastos Fijos",null,{"$f":"SUM(Prevision_mensual_gastos_fijos[[Mes 1 ]])","v":0},{"$f":"SUM(Prevision_mensual_gastos_fijos[Mes 2])","v":0},{"$f":"SUM(Prevision_mensual_gastos_fijos[[Mes 3 ]])","v":0},{"$f":"SUM(Prevision_mensual_gastos_fijos[[Mes 4 ]])","v":0},{"$f":"SUM(Prevision_mensual_gastos_fijos[[Mes 5 ]])","v":0},{"$f":"SUM(Prevision_mensual_gastos_fijos[[Mes 6 ]])","v":0},{"$f":"SUM(Prevision_mensual_gastos_fijos[[Mes 7 ]])","v":0},{"$f":"SUM(Prevision_mensual_gastos_fijos[[Mes 8 ]])","v":0},{"$f":"SUM(Prevision_mensual_gastos_fijos[[Mes 9 ]])","v":0},{"$f":"SUM(Prevision_mensual_gastos_fijos[[Mes 10 ]])","v":0},{"$f":"SUM(Prevision_mensual_gastos_fijos[[Mes 11 ]])","v":0},{"$f":"SUM(Prevision_mensual_gastos_fijos[[Mes 12 ]])","v":0},{"$f":"SUM(D42:O42)","v":0}]
[null,"Iva Gastos Fijos",null,{"$f":"SUMPRODUCT($C$13:$C$38,Prevision_mensual_gastos_fijos[[Mes 1 ]])","v":0},{"$f":"SUMPRODUCT($C$13:$C$38,Prevision_mensual_gastos_fijos[Mes 2])","v":0},{"$f":"SUMPRODUCT($C$13:$C$38,Prevision_mensual_gastos_fijos[[Mes 3 ]])","v":0},{"$f":"SUMPRODUCT($C$13:$C$38,Prevision_mensual_gastos_fijos[[Mes 4 ]])","v":0},{"$f":"SUMPRODUCT($C$13:$C$38,Prevision_mensual_gastos_fijos[[Mes 5 ]])","v":0},{"$f":"SUMPRODUCT($C$13:$C$38,Prevision_mensual_gastos_fijos[[Mes 5 ]])","v":0},{"$f":"SUMPRODUCT($C$13:$C$38,Prevision_mensual_gastos_fijos[[Mes 7 ]])","v":0},{"$f":"SUMPRODUCT($C$13:$C$38,Prevision_mensual_gastos_fijos[[Mes 8 ]])","v":0},{"$f":"SUMPRODUCT($C$13:$C$38,Prevision_mensual_gastos_fijos[[Mes 9 ]])","v":0},{"$f":"SUMPRODUCT($C$13:$C$38,Prevision_mensual_gastos_fijos[[Mes 10 ]])","v":0},{"$f":"SUMPRODUCT($C$13:$C$38,Prevision_mensual_gastos_fijos[[Mes 11 ]])","v":0},{"$f":"SUMPRODUCT($C$13:$C$38,Prevision_mensual_gastos_fijos[[Mes 12 ]])","v":0},{"$f":"P$42*$C$41","v":0}]
[null,"Total Importe Gastos Fijos",null,{"$f":"D42+D43","v":0},0,0,0,0,0,0,0,0,0,0,0,0]
[]
[]
[]
[]
[]
[]
[]
[]
[]
[null,"CALCULADORA GASTOS CORRIENTES RELACIONADOS CON EL CULTIVO"]
[]
[]
[null,"Concepto ",null,"Valor de referencia . Fuente de los valores de referencia de Mantenimiento de riego; Plantel; Fitosanitarios y Fertilizantes: media del gasto real de 5 proyectos productivos agroecológicos de la zona centro peninsular de 2 ha de media. En caso de tener una superficie menor los valores de referencia serán mayores. ",null,"Valores reales .Si tienes otros valores, distintos a estos de referencia que hemos incluido, puedes anotarlos en esta columna.  "]
[null,null,"Superficie utilizada","PRECIO  x m² sin IVA","TOTALES ","PRECIO  x m² sin IVA","TOTALES anuales "]
[null,"Mantenimiento del riego ",{"$f":"'2.PROYECTO'!$F$38","v":0},{"$f":"+'TABLAS REFERENCIA '!U9","v":0.12},{"$f":"D59*C59","v":0},2.3E-2,{"$f":"+F59*C59","v":0}]
[null,"Consumo de agua ",{"$f":"'2.PROYECTO'!$F$38","v":0},{"$f":"+'TABLAS REFERENCIA '!U8","v":1.26},{"$f":"D60*C60","v":0},0.01,{"$f":"+F60*C60","v":0}]
[null,"Plantel ",{"$f":"'2.PROYECTO'!$F$38","v":0},{"$f":"+'TABLAS REFERENCIA '!U10","v":0.15},{"$f":"D61*C61","v":0},0.15,{"$f":"+F61*C61","v":0}]
[null,"Fitosanitarios ",{"$f":"'2.PROYECTO'!$F$38","v":0},{"$f":"+'TABLAS REFERENCIA '!U11","v":0.08},{"$f":"D62*C62","v":0},0.08,{"$f":"+F62*C62","v":0}]
[null,"Fertilizantes ",{"$f":"'2.PROYECTO'!$F$38","v":0},{"$f":"+'TABLAS REFERENCIA '!U12","v":0.05},{"$f":"D63*C63","v":0},0.05,{"$f":"+F63*C63","v":0}]
[null,null,null,"TOTAL AÑO 1 ",{"$f":"SUM(E59:E63)","v":0},"TOTAL AÑO 1 ",{"$f":"SUM(G59:G63)","v":0}]

{"sheet":"ANEXO GASTOS VARIABLES","index":8,"n_rows":64,"n_cols":11,"rows_kept":64,"cut":false,"hidden":false,"merged":[[8,1,8,3]]}
[]
["Volver al Indice "]
[]
[]
[null,"GASTOS VARIABLES"]
[]
[]
[]
[null,"INCREMENTO/REDUCCION  DE GASTOS VARIABLES  (EN %) "]
[null,"DE AÑO 1 A AÑO 2 ","DE AÑO 2 A AÑO 3 ","DE AÑO 3 A AÑO 4 "]
[]
[]
[]
[]
[null,"Coste Variable por unidad vendida (en euros)"]
["IVA","Producto/Servicio","Mercancía y Mat. Prima","Coste de producción","Coste de transporte","Comisiones comerciales","Comisiones bancarias","Mermas y deterioro","Envasado","Otros costes","Coste variable unitario"]
[{"$f":"+IF('ANEXO INGRESOS'!D14=\"\",\"\",'ANEXO INGRESOS'!C14)","v":""},{"$f":"IF('ANEXO INGRESOS'!D14=\"\",\"\",'ANEXO INGRESOS'!D14)","v":""},null,null,null,null,null,null,null,null,{"$f":"SUM(C17:J17)","v":0}]
[{"$f":"+IF('ANEXO INGRESOS'!D15=\"\",\"\",'ANEXO INGRESOS'!C15)","v":""},{"$f":"IF('ANEXO INGRESOS'!D15=\"\",\"\",'ANEXO INGRESOS'!D15)","v":""},null,null,null,null,null,null,null,null,{"$f":"SUM(C18:J18)","v":0}]
[{"$f":"+IF('ANEXO INGRESOS'!D16=\"\",\"\",'ANEXO INGRESOS'!C16)","v":""},{"$f":"IF('ANEXO INGRESOS'!D16=\"\",\"\",'ANEXO INGRESOS'!D16)","v":""},null,null,null,null,null,null,null,null,{"$f":"SUM(C19:J19)","v":0}]
[{"$f":"+IF('ANEXO INGRESOS'!D17=\"\",\"\",'ANEXO INGRESOS'!C17)","v":""},{"$f":"IF('ANEXO INGRESOS'!D17=\"\",\"\",'ANEXO INGRESOS'!D17)","v":""},null,null,null,null,null,null,null,null,{"$f":"SUM(C20:J20)","v":0}]
[{"$f":"+IF('ANEXO INGRESOS'!D18=\"\",\"\",'ANEXO INGRESOS'!C18)","v":""},{"$f":"IF('ANEXO INGRESOS'!D18=\"\",\"\",'ANEXO INGRESOS'!D18)","v":""},null,null,null,null,null,null,null,null,{"$f":"SUM(C21:J21)","v":0}]
[{"$f":"+IF('ANEXO INGRESOS'!D19=\"\",\"\",'ANEXO INGRESOS'!C19)","v":""},{"$f":"IF('ANEXO INGRESOS'!D19=\"\",\"\",'ANEXO INGRESOS'!D19)","v":""},null,null,null,null,null,null,null,null,{"$f":"SUM(C22:J22)","v":0}]
[{"$f":"+IF('ANEXO INGRESOS'!D20=\"\",\"\",'ANEXO INGRESOS'!C20)","v":""},{"$f":"IF('ANEXO INGRESOS'!D20=\"\",\"\",'ANEXO INGRESOS'!D20)","v":""},null,null,null,null,null,null,null,null,0]
[{"$f":"+IF('ANEXO INGRESOS'!D21=\"\",\"\",'ANEXO INGRESOS'!C21)","v":""},{"$f":"IF('ANEXO INGRESOS'!D21=\"\",\"\",'ANEXO INGRESOS'!D21)","v":""},null,null,null,null,null,null,null,null,0]
[{"$f":"+IF('ANEXO INGRESOS'!D22=\"\",\"\",'ANEXO INGRESOS'!C22)","v":""},{"$f":"IF('ANEXO INGRESOS'!D22=\"\",\"\",'ANEXO INGRESOS'!D22)","v":""},null,null,null,null,null,null,null,null,0]
[{"$f":"+IF('ANEXO INGRESOS'!D23=\"\",\"\",'ANEXO INGRESOS'!C23)","v":""},{"$f":"IF('ANEXO INGRESOS'!D23=\"\",\"\",'ANEXO INGRESOS'!D23)","v":""},null,null,null,null,null,null,null,null,0]
[{"$f":"+IF('ANEXO INGRESOS'!D24=\"\",\"\",'ANEXO INGRESOS'!C24)","v":""},{"$f":"IF('ANEXO INGRESOS'!D24=\"\",\"\",'ANEXO INGRESOS'!D24)","v":""},null,null,null,null,null,null,null,null,0]
[{"$f":"+IF('ANEXO INGRESOS'!D25=\"\",\"\",'ANEXO INGRESOS'!C25)","v":""},{"$f":"IF('ANEXO INGRESOS'!D25=\"\",\"\",'ANEXO INGRESOS'!D25)","v":""},null,null,null,null,null,null,null,null,0]
[{"$f":"+IF('ANEXO INGRESOS'!D26=\"\",\"\",'ANEXO INGRESOS'!C26)","v":""},{"$f":"IF('ANEXO INGRESOS'!D26=\"\",\"\",'ANEXO INGRESOS'!D26)","v":""},null,null,null,null,null,null,null,null,0]
[{"$f":"+IF('ANEXO INGRESOS'!D27=\"\",\"\",'ANEXO INGRESOS'!C27)","v":""},{"$f":"IF('ANEXO INGRESOS'!D27=\"\",\"\",'ANEXO INGRESOS'!D27)","v":""},null,null,null,null,null,null,null,null,0]
[{"$f":"+IF('ANEXO INGRESOS'!D28=\"\",\"\",'ANEXO INGRESOS'!C28)","v":""},{"$f":"IF('ANEXO INGRESOS'!D28=\"\",\"\",'ANEXO INGRESOS'!D28)","v":""},null,null,null,null,null,null,null,null,0]
[{"$f":"+IF('ANEXO INGRESOS'!D29=\"\",\"\",'ANEXO INGRESOS'!C29)","v":""},{"$f":"IF('ANEXO INGRESOS'!D29=\"\",\"\",'ANEXO INGRESOS'!D29)","v":""},null,null,null,null,null,null,null,null,0]
[{"$f":"+IF('ANEXO INGRESOS'!D30=\"\",\"\",'ANEXO INGRESOS'!C30)","v":""},{"$f":"IF('ANEXO INGRESOS'!D30=\"\",\"\",'ANEXO INGRESOS'!D30)","v":""},null,null,null,null,null,null,null,null,{"$f":"SUM(C33:J33)","v":0}]
[{"$f":"+IF('ANEXO INGRESOS'!D31=\"\",\"\",'ANEXO INGRESOS'!C31)","v":""},{"$f":"IF('ANEXO INGRESOS'!D31=\"\",\"\",'ANEXO INGRESOS'!D31)","v":""},null,null,null,null,null,null,null,null,0]
[{"$f":"+IF('ANEXO INGRESOS'!D32=\"\",\"\",'ANEXO INGRESOS'!C32)","v":""},{"$f":"IF('ANEXO INGRESOS'!D32=\"\",\"\",'ANEXO INGRESOS'!D32)","v":""},null,null,null,null,null,null,null,null,0]
[{"$f":"+IF('ANEXO INGRESOS'!D33=\"\",\"\",'ANEXO INGRESOS'!C33)","v":""},{"$f":"IF('ANEXO INGRESOS'!D33=\"\",\"\",'ANEXO INGRESOS'!D33)","v":""},null,null,null,null,null,null,null,null,0]
[{"$f":"+IF('ANEXO INGRESOS'!D34=\"\",\"\",'ANEXO INGRESOS'!C34)","v":""},{"$f":"IF('ANEXO INGRESOS'!D34=\"\",\"\",'ANEXO INGRESOS'!D34)","v":""},null,null,null,null,null,null,null,null,0]
[{"$f":"+IF('ANEXO INGRESOS'!D35=\"\",\"\",'ANEXO INGRESOS'!C35)","v":""},{"$f":"IF('ANEXO INGRESOS'!D35=\"\",\"\",'ANEXO INGRESOS'!D35)","v":""},null,null,null,null,null,null,null,null,{"$f":"SUM(C38:J38)","v":0}]
[{"$f":"+IF('ANEXO INGRESOS'!D36=\"\",\"\",'ANEXO INGRESOS'!C36)","v":""},{"$f":"IF('ANEXO INGRESOS'!D36=\"\",\"\",'ANEXO INGRESOS'!D36)","v":""},null,null,null,null,null,null,null,null,{"$f":"SUM(C39:J39)","v":0}]
[{"$f":"+IF('ANEXO INGRESOS'!D37=\"\",\"\",'ANEXO INGRESOS'!C37)","v":""},{"$f":"IF('ANEXO INGRESOS'!D37=\"\",\"\",'ANEXO INGRESOS'!D37)","v":""},null,null,null,null,null,null,null,null,0]
[{"$f":"+IF('ANEXO INGRESOS'!D38=\"\",\"\",'ANEXO INGRESOS'!C38)","v":""},{"$f":"IF('ANEXO INGRESOS'!D38=\"\",\"\",'ANEXO INGRESOS'!D38)","v":""},null,null,null,null,null,null,null,null,0]
[{"$f":"+IF('ANEXO INGRESOS'!D39=\"\",\"\",'ANEXO INGRESOS'!C39)","v":""},{"$f":"IF('ANEXO INGRESOS'!D39=\"\",\"\",'ANEXO INGRESOS'!D39)","v":""},null,null,null,null,null,null,null,null,0]
[{"$f":"+IF('ANEXO INGRESOS'!D40=\"\",\"\",'ANEXO INGRESOS'!C40)","v":""},{"$f":"IF('ANEXO INGRESOS'!D40=\"\",\"\",'ANEXO INGRESOS'!D40)","v":""},null,null,null,null,null,null,null,null,0]
[{"$f":"+IF('ANEXO INGRESOS'!D41=\"\",\"\",'ANEXO INGRESOS'!C41)","v":""},{"$f":"IF('ANEXO INGRESOS'!D41=\"\",\"\",'ANEXO INGRESOS'!D41)","v":""},null,null,null,null,null,null,null,null,0]
[{"$f":"+IF('ANEXO INGRESOS'!D42=\"\",\"\",'ANEXO INGRESOS'!C42)","v":""},{"$f":"IF('ANEXO INGRESOS'!D42=\"\",\"\",'ANEXO INGRESOS'!D42)","v":""},null,null,null,null,null,null,null,null,0]
[{"$f":"+IF('ANEXO INGRESOS'!D43=\"\",\"\",'ANEXO INGRESOS'!C43)","v":""},{"$f":"IF('ANEXO INGRESOS'!D43=\"\",\"\",'ANEXO INGRESOS'!D43)","v":""},null,null,null,null,null,null,null,null,0]
[{"$f":"+IF('ANEXO INGRESOS'!D44=\"\",\"\",'ANEXO INGRESOS'!C44)","v":""},{"$f":"IF('ANEXO INGRESOS'!D44=\"\",\"\",'ANEXO INGRESOS'!D44)","v":""},null,null,null,null,null,null,null,null,0]
[{"$f":"+IF('ANEXO INGRESOS'!D45=\"\",\"\",'ANEXO INGRESOS'!C45)","v":""},{"$f":"IF('ANEXO INGRESOS'!D45=\"\",\"\",'ANEXO INGRESOS'!D45)","v":""},null,null,null,null,null,null,null,null,{"$f":"SUM(C48:J48)","v":0}]
[]
[]
[]
[null,"Coste Variable por unidad vendida (en euros)"]
["IVA","Producto/Servicio","Mercancía y Mat. Prima","Coste de producción","Coste de transporte","Comisiones comerciales","Comisiones bancarias","Mermas y deterioro","Envasado","Otros costes","Coste variable unitario"]
[{"$f":"+IF('ANEXO INGRESOS'!D51=\"\",\"\",'ANEXO INGRESOS'!C51)","v":""},{"$f":"IF('ANEXO INGRESOS'!D51=\"\",\"\",'ANEXO INGRESOS'!D51)","v":""},null,null,null,null,null,null,null,null,{"$f":"SUM(C54:J54)","v":0}]
[{"$f":"+IF('ANEXO INGRESOS'!D52=\"\",\"\",'ANEXO INGRESOS'!C52)","v":""},{"$f":"IF('ANEXO INGRESOS'!D52=\"\",\"\",'ANEXO INGRESOS'!D52)","v":""},null,null,null,null,null,null,null,null,{"$f":"SUM(C55:J55)","v":0}]
[{"$f":"+IF('ANEXO INGRESOS'!D53=\"\",\"\",'ANEXO INGRESOS'!C53)","v":""},{"$f":"IF('ANEXO INGRESOS'!D53=\"\",\"\",'ANEXO INGRESOS'!D53)","v":""},null,null,null,null,null,null,null,null,{"$f":"SUM(C56:J56)","v":0}]
[{"$f":"+IF('ANEXO INGRESOS'!D54=\"\",\"\",'ANEXO INGRESOS'!C54)","v":""},{"$f":"IF('ANEXO INGRESOS'!D54=\"\",\"\",'ANEXO INGRESOS'!D54)","v":""},null,null,null,null,null,null,null,null,{"$f":"SUM(C57:J57)","v":0}]
[{"$f":"+IF('ANEXO INGRESOS'!D55=\"\",\"\",'ANEXO INGRESOS'!C55)","v":""},{"$f":"IF('ANEXO INGRESOS'!D55=\"\",\"\",'ANEXO INGRESOS'!D55)","v":""},null,null,null,null,null,null,null,null,{"$f":"SUM(C58:J58)","v":0}]
[{"$f":"+IF('ANEXO INGRESOS'!D56=\"\",\"\",'ANEXO INGRESOS'!C56)","v":""},{"$f":"IF('ANEXO INGRESOS'!D56=\"\",\"\",'ANEXO INGRESOS'!D56)","v":""},null,null,null,null,null,null,null,null,{"$f":"SUM(C59:J59)","v":0}]
[{"$f":"+IF('ANEXO INGRESOS'!D57=\"\",\"\",'ANEXO INGRESOS'!C57)","v":""},{"$f":"IF('ANEXO INGRESOS'!D57=\"\",\"\",'ANEXO INGRESOS'!D57)","v":""},null,null,null,null,null,null,null,null,0]
[{"$f":"+IF('ANEXO INGRESOS'!D58=\"\",\"\",'ANEXO INGRESOS'!C58)","v":""},{"$f":"IF('ANEXO INGRESOS'!D58=\"\",\"\",'ANEXO INGRESOS'!D58)","v":""},null,null,null,null,null,null,null,null,0]
[{"$f":"+IF('ANEXO INGRESOS'!D59=\"\",\"\",'ANEXO INGRESOS'!C59)","v":""},{"$f":"IF('ANEXO INGRESOS'!D59=\"\",\"\",'ANEXO INGRESOS'!D59)","v":""},null,null,null,null,null,null,null,null,0]
[{"$f":"+IF('ANEXO INGRESOS'!D60=\"\",\"\",'ANEXO INGRESOS'!C60)","v":""},{"$f":"IF('ANEXO INGRESOS'!D60=\"\",\"\",'ANEXO INGRESOS'!D60)","v":""},null,null,null,null,null,null,null,null,0]
[{"$f":"+IF('ANEXO INGRESOS'!D61=\"\",\"\",'ANEXO INGRESOS'!C61)","v":""},{"$f":"IF('ANEXO INGRESOS'!D61=\"\",\"\",'ANEXO INGRESOS'!D61)","v":""},null,null,null,null,null,null,null,null,0]

{"sheet":"ANEXO TESORERIA","index":9,"n_rows":168,"n_cols":17,"rows_kept":168,"cut":false,"hidden":false,"merged":[]}
[]
[null,"Volver al Indice "]
[]
[]
[]
[null," "]
[]
[]
[null,"INGRESOS PRODUCTOS / SERVICIOS ( sin IVA )"]
[]
[null,null,null,null,{"$f":"'7.CUENTA DE RESULTADOS '!C20","v":"1900enero"},{"$f":"'7.CUENTA DE RESULTADOS '!D20","v":"1900enero"},{"$f":"'7.CUENTA DE RESULTADOS '!E20","v":"1900febrero"},{"$f":"'7.CUENTA DE RESULTADOS '!F20","v":"1900marzo"},{"$f":"'7.CUENTA DE RESULTADOS '!G20","v":"1900abril"},{"$f":"'7.CUENTA DE RESULTADOS '!H20","v":"1900mayo"},{"$f":"'7.CUENTA DE RESULTADOS '!I20","v":"1900junio"},{"$f":"'7.CUENTA DE RESULTADOS '!J20","v":"1900julio"},{"$f":"'7.CUENTA DE RESULTADOS '!K20","v":"1900agosto"},{"$f":"'7.CUENTA DE RESULTADOS '!L20","v":"1900septiembre"},{"$f":"'7.CUENTA DE RESULTADOS '!M20","v":"1900octubre"},{"$f":"'7.CUENTA DE RESULTADOS '!N20","v":"1900noviembre"},"TOTALES "]
[null,null,null,{"$f":"IF('4.INGRESOS'!C22=\"\",\"\",'4.INGRESOS'!C22)","v":""},{"$f":"IF($D12=\"\",\"\",'4.INGRESOS'!D22)","v":""},{"$f":"IF($D12=\"\",\"\",'4.INGRESOS'!E22)","v":""},{"$f":"IF($D12=\"\",\"\",'4.INGRESOS'!F22)","v":""},{"$f":"IF($D12=\"\",\"\",'4.INGRESOS'!G22)","v":""},{"$f":"IF($D12=\"\",\"\",'4.INGRESOS'!H22)","v":""},{"$f":"IF($D12=\"\",\"\",'4.INGRESOS'!I22)","v":""},{"$f":"IF($D12=\"\",\"\",'4.INGRESOS'!J22)","v":""},{"$f":"IF($D12=\"\",\"\",'4.INGRESOS'!K22)","v":""},{"$f":"IF($D12=\"\",\"\",'4.INGRESOS'!L22)","v":""},{"$f":"IF($D12=\"\",\"\",'4.INGRESOS'!M22)","v":""},{"$f":"IF($D12=\"\",\"\",'4.INGRESOS'!N22)","v":""},{"$f":"IF($D12=\"\",\"\",'4.INGRESOS'!O22)","v":""},{"$f":"IF(D12=\"\",\"\",SUM(E12:P12))","v":""}]
[null,null,null,{"$f":"IF('4.INGRESOS'!C23=\"\",\"\",'4.INGRESOS'!C23)","v":""},{"$f":"IF($D13=\"\",\"\",'4.INGRESOS'!D23)","v":""},{"$f":"IF($D13=\"\",\"\",'4.INGRESOS'!E23)","v":""},{"$f":"IF($D13=\"\",\"\",'4.INGRESOS'!F23)","v":""},{"$f":"IF($D13=\"\",\"\",'4.INGRESOS'!G23)","v":""},{"$f":"IF($D13=\"\",\"\",'4.INGRESOS'!H23)","v":""},{"$f":"IF($D13=\"\",\"\",'4.INGRESOS'!I23)","v":""},{"$f":"IF($D13=\"\",\"\",'4.INGRESOS'!J23)","v":""},{"$f":"IF($D13=\"\",\"\",'4.INGRESOS'!K23)","v":""},{"$f":"IF($D13=\"\",\"\",'4.INGRESOS'!L23)","v":""},{"$f":"IF($D13=\"\",\"\",'4.INGRESOS'!M23)","v":""},{"$f":"IF($D13=\"\",\"\",'4.INGRESOS'!N23)","v":""},{"$f":"IF($D13=\"\",\"\",'4.INGRESOS'!O23)","v":""},{"$f":"IF(D13=\"\",\"\",SUM(E13:P13))","v":""}]
[null,null,null,{"$f":"IF('4.INGRESOS'!C24=\"\",\"\",'4.INGRESOS'!C24)","v":""},{"$f":"IF($D14=\"\",\"\",'4.INGRESOS'!D24)","v":""},{"$f":"IF($D14=\"\",\"\",'4.INGRESOS'!E24)","v":""},{"$f":"IF($D14=\"\",\"\",'4.INGRESOS'!F24)","v":""},{"$f":"IF($D14=\"\",\"\",'4.INGRESOS'!G24)","v":""},{"$f":"IF($D14=\"\",\"\",'4.INGRESOS'!H24)","v":""},{"$f":"IF($D14=\"\",\"\",'4.INGRESOS'!I24)","v":""},{"$f":"IF($D14=\"\",\"\",'4.INGRESOS'!J24)","v":""},{"$f":"IF($D14=\"\",\"\",'4.INGRESOS'!K24)","v":""},{"$f":"IF($D14=\"\",\"\",'4.INGRESOS'!L24)","v":""},{"$f":"IF($D14=\"\",\"\",'4.INGRESOS'!M24)","v":""},{"$f":"IF($D14=\"\",\"\",'4.INGRESOS'!N24)","v":""},{"$f":"IF($D14=\"\",\"\",'4.INGRESOS'!O24)","v":""},""]
[null,null,null,{"$f":"IF('4.INGRESOS'!C25=\"\",\"\",'4.INGRESOS'!C25)","v":""},{"$f":"IF($D15=\"\",\"\",'4.INGRESOS'!D25)","v":""},{"$f":"IF($D15=\"\",\"\",'4.INGRESOS'!E25)","v":""},{"$f":"IF($D15=\"\",\"\",'4.INGRESOS'!F25)","v":""},{"$f":"IF($D15=\"\",\"\",'4.INGRESOS'!G25)","v":""},{"$f":"IF($D15=\"\",\"\",'4.INGRESOS'!H25)","v":""},{"$f":"IF($D15=\"\",\"\",'4.INGRESOS'!I25)","v":""},{"$f":"IF($D15=\"\",\"\",'4.INGRESOS'!J25)","v":""},{"$f":"IF($D15=\"\",\"\",'4.INGRESOS'!K25)","v":""},{"$f":"IF($D15=\"\",\"\",'4.INGRESOS'!L25)","v":""},{"$f":"IF($D15=\"\",\"\",'4.INGRESOS'!M25)","v":""},{"$f":"IF($D15=\"\",\"\",'4.INGRESOS'!N25)","v":""},{"$f":"IF($D15=\"\",\"\",'4.INGRESOS'!O25)","v":""},""]
[null,null,null,{"$f":"IF('4.INGRESOS'!C26=\"\",\"\",'4.INGRESOS'!C26)","v":""},{"$f":"IF($D16=\"\",\"\",'4.INGRESOS'!D26)","v":""},{"$f":"IF($D16=\"\",\"\",'4.INGRESOS'!E26)","v":""},{"$f":"IF($D16=\"\",\"\",'4.INGRESOS'!F26)","v":""},{"$f":"IF($D16=\"\",\"\",'4.INGRESOS'!G26)","v":""},{"$f":"IF($D16=\"\",\"\",'4.INGRESOS'!H26)","v":""},{"$f":"IF($D16=\"\",\"\",'4.INGRESOS'!I26)","v":""},{"$f":"IF($D16=\"\",\"\",'4.INGRESOS'!J26)","v":""},{"$f":"IF($D16=\"\",\"\",'4.INGRESOS'!K26)","v":""},{"$f":"IF($D16=\"\",\"\",'4.INGRESOS'!L26)","v":""},{"$f":"IF($D16=\"\",\"\",'4.INGRESOS'!M26)","v":""},{"$f":"IF($D16=\"\",\"\",'4.INGRESOS'!N26)","v":""},{"$f":"IF($D16=\"\",\"\",'4.INGRESOS'!O26)","v":""},""]
[null,null,null,{"$f":"IF('4.INGRESOS'!C27=\"\",\"\",'4.INGRESOS'!C27)","v":""},{"$f":"IF($D17=\"\",\"\",'4.INGRESOS'!D27)","v":""},{"$f":"IF($D17=\"\",\"\",'4.INGRESOS'!E27)","v":""},{"$f":"IF($D17=\"\",\"\",'4.INGRESOS'!F27)","v":""},{"$f":"IF($D17=\"\",\"\",'4.INGRESOS'!G27)","v":""},{"$f":"IF($D17=\"\",\"\",'4.INGRESOS'!H27)","v":""},{"$f":"IF($D17=\"\",\"\",'4.INGRESOS'!I27)","v":""},{"$f":"IF($D17=\"\",\"\",'4.INGRESOS'!J27)","v":""},{"$f":"IF($D17=\"\",\"\",'4.INGRESOS'!K27)","v":""},{"$f":"IF($D17=\"\",\"\",'4.INGRESOS'!L27)","v":""},{"$f":"IF($D17=\"\",\"\",'4.INGRESOS'!M27)","v":""},{"$f":"IF($D17=\"\",\"\",'4.INGRESOS'!N27)","v":""},{"$f":"IF($D17=\"\",\"\",'4.INGRESOS'!O27)","v":""},""]
[null,null,null,{"$f":"IF('4.INGRESOS'!C28=\"\",\"\",'4.INGRESOS'!C28)","v":""},{"$f":"IF($D18=\"\",\"\",'4.INGRESOS'!D28)","v":""},{"$f":"IF($D18=\"\",\"\",'4.INGRESOS'!E28)","v":""},{"$f":"IF($D18=\"\",\"\",'4.INGRESOS'!F28)","v":""},{"$f":"IF($D18=\"\",\"\",'4.INGRESOS'!G28)","v":""},{"$f":"IF($D18=\"\",\"\",'4.INGRESOS'!H28)","v":""},{"$f":"IF($D18=\"\",\"\",'4.INGRESOS'!I28)","v":""},{"$f":"IF($D18=\"\",\"\",'4.INGRESOS'!J28)","v":""},{"$f":"IF($D18=\"\",\"\",'4.INGRESOS'!K28)","v":""},{"$f":"IF($D18=\"\",\"\",'4.INGRESOS'!L28)","v":""},{"$f":"IF($D18=\"\",\"\",'4.INGRESOS'!M28)","v":""},{"$f":"IF($D18=\"\",\"\",'4.INGRESOS'!N28)","v":""},{"$f":"IF($D18=\"\",\"\",'4.INGRESOS'!O28)","v":""},""]
[null,null,null,{"$f":"IF('4.INGRESOS'!C29=\"\",\"\",'4.INGRESOS'!C29)","v":""},{"$f":"IF('4.INGRESOS'!D29=\"\",\"\",'4.INGRESOS'!D29)","v":""},{"$f":"IF('4.INGRESOS'!E29=\"\",\"\",'4.INGRESOS'!E29)","v":""},{"$f":"IF('4.INGRESOS'!F29=\"\",\"\",'4.INGRESOS'!F29)","v":""},{"$f":"IF('4.INGRESOS'!G29=\"\",\"\",'4.INGRESOS'!G29)","v":""},{"$f":"IF('4.INGRESOS'!H29=\"\",\"\",'4.INGRESOS'!H29)","v":""},{"$f":"IF('4.INGRESOS'!I29=\"\",\"\",'4.INGRESOS'!I29)","v":""},{"$f":"IF('4.INGRESOS'!J29=\"\",\"\",'4.INGRESOS'!J29)","v":""},{"$f":"IF('4.INGRESOS'!K29=\"\",\"\",'4.INGRESOS'!K29)","v":""},{"$f":"IF('4.INGRESOS'!L29=\"\",\"\",'4.INGRESOS'!L29)","v":""},{"$f":"IF('4.INGRESOS'!M29=\"\",\"\",'4.INGRESOS'!M29)","v":""},{"$f":"IF('4.INGRESOS'!N29=\"\",\"\",'4.INGRESOS'!N29)","v":""},{"$f":"IF('4.INGRESOS'!O29=\"\",\"\",'4.INGRESOS'!O29)","v":""},""]
[null,null,null,{"$f":"IF('4.INGRESOS'!C30=\"\",\"\",'4.INGRESOS'!C30)","v":""},{"$f":"IF('4.INGRESOS'!D30=\"\",\"\",'4.INGRESOS'!D30)","v":""},{"$f":"IF('4.INGRESOS'!E30=\"\",\"\",'4.INGRESOS'!E30)","v":""},{"$f":"IF('4.INGRESOS'!F30=\"\",\"\",'4.INGRESOS'!F30)","v":""},{"$f":"IF('4.INGRESOS'!G30=\"\",\"\",'4.INGRESOS'!G30)","v":""},{"$f":"IF('4.INGRESOS'!H30=\"\",\"\",'4.INGRESOS'!H30)","v":""},{"$f":"IF('4.INGRESOS'!I30=\"\",\"\",'4.INGRESOS'!I30)","v":""},{"$f":"IF('4.INGRESOS'!J30=\"\",\"\",'4.INGRESOS'!J30)","v":""},{"$f":"IF('4.INGRESOS'!K30=\"\",\"\",'4.INGRESOS'!K30)","v":""},{"$f":"IF('4.INGRESOS'!L30=\"\",\"\",'4.INGRESOS'!L30)","v":""},{"$f":"IF('4.INGRESOS'!M30=\"\",\"\",'4.INGRESOS'!M30)","v":""},{"$f":"IF('4.INGRESOS'!N30=\"\",\"\",'4.INGRESOS'!N30)","v":""},{"$f":"IF('4.INGRESOS'!O30=\"\",\"\",'4.INGRESOS'!O30)","v":""},""]
[null,null,null,{"$f":"IF('4.INGRESOS'!C31=\"\",\"\",'4.INGRESOS'!C31)","v":""},{"$f":"IF('4.INGRESOS'!D31=\"\",\"\",'4.INGRESOS'!D31)","v":""},{"$f":"IF('4.INGRESOS'!E31=\"\",\"\",'4.INGRESOS'!E31)","v":""},{"$f":"IF('4.INGRESOS'!F31=\"\",\"\",'4.INGRESOS'!F31)","v":""},{"$f":"IF('4.INGRESOS'!G31=\"\",\"\",'4.INGRESOS'!G31)","v":""},{"$f":"IF('4.INGRESOS'!H31=\"\",\"\",'4.INGRESOS'!H31)","v":""},{"$f":"IF('4.INGRESOS'!I31=\"\",\"\",'4.INGRESOS'!I31)","v":""},{"$f":"IF('4.INGRESOS'!J31=\"\",\"\",'4.INGRESOS'!J31)","v":""},{"$f":"IF('4.INGRESOS'!K31=\"\",\"\",'4.INGRESOS'!K31)","v":""},{"$f":"IF('4.INGRESOS'!L31=\"\",\"\",'4.INGRESOS'!L31)","v":""},{"$f":"IF('4.INGRESOS'!M31=\"\",\"\",'4.INGRESOS'!M31)","v":""},{"$f":"IF('4.INGRESOS'!N31=\"\",\"\",'4.INGRESOS'!N31)","v":""},{"$f":"IF('4.INGRESOS'!O31=\"\",\"\",'4.INGRESOS'!O31)","v":""},""]
[null,null,null,{"$f":"IF('4.INGRESOS'!C32=\"\",\"\",'4.INGRESOS'!C32)","v":""},{"$f":"IF('4.INGRESOS'!D32=\"\",\"\",'4.INGRESOS'!D32)","v":""},{"$f":"IF('4.INGRESOS'!E32=\"\",\"\",'4.INGRESOS'!E32)","v":""},{"$f":"IF('4.INGRESOS'!F32=\"\",\"\",'4.INGRESOS'!F32)","v":""},{"$f":"IF('4.INGRESOS'!G32=\"\",\"\",'4.INGRESOS'!G32)","v":""},{"$f":"IF('4.INGRESOS'!H32=\"\",\"\",'4.INGRESOS'!H32)","v":""},{"$f":"IF('4.INGRESOS'!I32=\"\",\"\",'4.INGRESOS'!I32)","v":""},{"$f":"IF('4.INGRESOS'!J32=\"\",\"\",'4.INGRESOS'!J32)","v":""},{"$f":"IF('4.INGRESOS'!K32=\"\",\"\",'4.INGRESOS'!K32)","v":""},{"$f":"IF('4.INGRESOS'!L32=\"\",\"\",'4.INGRESOS'!L32)","v":""},{"$f":"IF('4.INGRESOS'!M32=\"\",\"\",'4.INGRESOS'!M32)","v":""},{"$f":"IF('4.INGRESOS'!N32=\"\",\"\",'4.INGRESOS'!N32)","v":""},{"$f":"IF('4.INGRESOS'!O32=\"\",\"\",'4.INGRESOS'!O32)","v":""},""]
[null,null,null,{"$f":"IF('4.INGRESOS'!C33=\"\",\"\",'4.INGRESOS'!C33)","v":""},{"$f":"IF('4.INGRESOS'!D33=\"\",\"\",'4.INGRESOS'!D33)","v":""},{"$f":"IF('4.INGRESOS'!E33=\"\",\"\",'4.INGRESOS'!E33)","v":""},{"$f":"IF('4.INGRESOS'!F33=\"\",\"\",'4.INGRESOS'!F33)","v":""},{"$f":"IF('4.INGRESOS'!G33=\"\",\"\",'4.INGRESOS'!G33)","v":""},{"$f":"IF('4.INGRESOS'!H33=\"\",\"\",'4.INGRESOS'!H33)","v":""},{"$f":"IF('4.INGRESOS'!I33=\"\",\"\",'4.INGRESOS'!I33)","v":""},{"$f":"IF('4.INGRESOS'!J33=\"\",\"\",'4.INGRESOS'!J33)","v":""},{"$f":"IF('4.INGRESOS'!K33=\"\",\"\",'4.INGRESOS'!K33)","v":""},{"$f":"IF('4.INGRESOS'!L33=\"\",\"\",'4.INGRESOS'!L33)","v":""},{"$f":"IF('4.INGRESOS'!M33=\"\",\"\",'4.INGRESOS'!M33)","v":""},{"$f":"IF('4.INGRESOS'!N33=\"\",\"\",'4.INGRESOS'!N33)","v":""},{"$f":"IF('4.INGRESOS'!O33=\"\",\"\",'4.INGRESOS'!O33)","v":""},""]
[null,null,null,{"$f":"IF('4.INGRESOS'!C34=\"\",\"\",'4.INGRESOS'!C34)","v":""},{"$f":"IF('4.INGRESOS'!D34=\"\",\"\",'4.INGRESOS'!D34)","v":""},{"$f":"IF('4.INGRESOS'!E34=\"\",\"\",'4.INGRESOS'!E34)","v":""},{"$f":"IF('4.INGRESOS'!F34=\"\",\"\",'4.INGRESOS'!F34)","v":""},{"$f":"IF('4.INGRESOS'!G34=\"\",\"\",'4.INGRESOS'!G34)","v":""},{"$f":"IF('4.INGRESOS'!H34=\"\",\"\",'4.INGRESOS'!H34)","v":""},{"$f":"IF('4.INGRESOS'!I34=\"\",\"\",'4.INGRESOS'!I34)","v":""},{"$f":"IF('4.INGRESOS'!J34=\"\",\"\",'4.INGRESOS'!J34)","v":""},{"$f":"IF('4.INGRESOS'!K34=\"\",\"\",'4.INGRESOS'!K34)","v":""},{"$f":"IF('4.INGRESOS'!L34=\"\",\"\",'4.INGRESOS'!L34)","v":""},{"$f":"IF('4.INGRESOS'!M34=\"\",\"\",'4.INGRESOS'!M34)","v":""},{"$f":"IF('4.INGRESOS'!N34=\"\",\"\",'4.INGRESOS'!N34)","v":""},{"$f":"IF('4.INGRESOS'!O34=\"\",\"\",'4.INGRESOS'!O34)","v":""},""]
[null,null,null,{"$f":"IF('4.INGRESOS'!C35=\"\",\"\",'4.INGRESOS'!C35)","v":""},{"$f":"IF('4.INGRESOS'!D35=\"\",\"\",'4.INGRESOS'!D35)","v":""},{"$f":"IF('4.INGRESOS'!E35=\"\",\"\",'4.INGRESOS'!E35)","v":""},{"$f":"IF('4.INGRESOS'!F35=\"\",\"\",'4.INGRESOS'!F35)","v":""},{"$f":"IF('4.INGRESOS'!G35=\"\",\"\",'4.INGRESOS'!G35)","v":""},{"$f":"IF('4.INGRESOS'!H35=\"\",\"\",'4.INGRESOS'!H35)","v":""},{"$f":"IF('4.INGRESOS'!I35=\"\",\"\",'4.INGRESOS'!I35)","v":""},{"$f":"IF('4.INGRESOS'!J35=\"\",\"\",'4.INGRESOS'!J35)","v":""},{"$f":"IF('4.INGRESOS'!K35=\"\",\"\",'4.INGRESOS'!K35)","v":""},{"$f":"IF('4.INGRESOS'!L35=\"\",\"\",'4.INGRESOS'!L35)","v":""},{"$f":"IF('4.INGRESOS'!M35=\"\",\"\",'4.INGRESOS'!M35)","v":""},{"$f":"IF('4.INGRESOS'!N35=\"\",\"\",'4.INGRESOS'!N35)","v":""},{"$f":"IF('4.INGRESOS'!O35=\"\",\"\",'4.INGRESOS'!O35)","v":""},""]
[null,null,null,{"$f":"IF('4.INGRESOS'!C36=\"\",\"\",'4.INGRESOS'!C36)","v":""},{"$f":"IF('4.INGRESOS'!D36=\"\",\"\",'4.INGRESOS'!D36)","v":""},{"$f":"IF('4.INGRESOS'!E36=\"\",\"\",'4.INGRESOS'!E36)","v":""},{"$f":"IF('4.INGRESOS'!F36=\"\",\"\",'4.INGRESOS'!F36)","v":""},{"$f":"IF('4.INGRESOS'!G36=\"\",\"\",'4.INGRESOS'!G36)","v":""},{"$f":"IF('4.INGRESOS'!H36=\"\",\"\",'4.INGRESOS'!H36)","v":""},{"$f":"IF('4.INGRESOS'!I36=\"\",\"\",'4.INGRESOS'!I36)","v":""},{"$f":"IF('4.INGRESOS'!J36=\"\",\"\",'4.INGRESOS'!J36)","v":""},{"$f":"IF('4.INGRESOS'!K36=\"\",\"\",'4.INGRESOS'!K36)","v":""},{"$f":"IF('4.INGRESOS'!L36=\"\",\"\",'4.INGRESOS'!L36)","v":""},{"$f":"IF('4.INGRESOS'!M36=\"\",\"\",'4.INGRESOS'!M36)","v":""},{"$f":"IF('4.INGRESOS'!N36=\"\",\"\",'4.INGRESOS'!N36)","v":""},{"$f":"IF('4.INGRESOS'!O36=\"\",\"\",'4.INGRESOS'!O36)","v":""},""]
[null,null,null,{"$f":"IF('4.INGRESOS'!C37=\"\",\"\",'4.INGRESOS'!C37)","v":""},{"$f":"IF('4.INGRESOS'!D37=\"\",\"\",'4.INGRESOS'!D37)","v":""},{"$f":"IF('4.INGRESOS'!E37=\"\",\"\",'4.INGRESOS'!E37)","v":""},{"$f":"IF('4.INGRESOS'!F37=\"\",\"\",'4.INGRESOS'!F37)","v":""},{"$f":"IF('4.INGRESOS'!G37=\"\",\"\",'4.INGRESOS'!G37)","v":""},{"$f":"IF('4.INGRESOS'!H37=\"\",\"\",'4.INGRESOS'!H37)","v":""},{"$f":"IF('4.INGRESOS'!I37=\"\",\"\",'4.INGRESOS'!I37)","v":""},{"$f":"IF('4.INGRESOS'!J37=\"\",\"\",'4.INGRESOS'!J37)","v":""},{"$f":"IF('4.INGRESOS'!K37=\"\",\"\",'4.INGRESOS'!K37)","v":""},{"$f":"IF('4.INGRESOS'!L37=\"\",\"\",'4.INGRESOS'!L37)","v":""},{"$f":"IF('4.INGRESOS'!M37=\"\",\"\",'4.INGRESOS'!M37)","v":""},{"$f":"IF('4.INGRESOS'!N37=\"\",\"\",'4.INGRESOS'!N37)","v":""},{"$f":"IF('4.INGRESOS'!O37=\"\",\"\",'4.INGRESOS'!O37)","v":""},""]
[null,null,null,{"$f":"IF('4.INGRESOS'!C38=\"\",\"\",'4.INGRESOS'!C38)","v":""},{"$f":"IF('4.INGRESOS'!D38=\"\",\"\",'4.INGRESOS'!D38)","v":""},{"$f":"IF('4.INGRESOS'!E38=\"\",\"\",'4.INGRESOS'!E38)","v":""},{"$f":"IF('4.INGRESOS'!F38=\"\",\"\",'4.INGRESOS'!F38)","v":""},{"$f":"IF('4.INGRESOS'!G38=\"\",\"\",'4.INGRESOS'!G38)","v":""},{"$f":"IF('4.INGRESOS'!H38=\"\",\"\",'4.INGRESOS'!H38)","v":""},{"$f":"IF('4.INGRESOS'!I38=\"\",\"\",'4.INGRESOS'!I38)","v":""},{"$f":"IF('4.INGRESOS'!J38=\"\",\"\",'4.INGRESOS'!J38)","v":""},{"$f":"IF('4.INGRESOS'!K38=\"\",\"\",'4.INGRESOS'!K38)","v":""},{"$f":"IF('4.INGRESOS'!L38=\"\",\"\",'4.INGRESOS'!L38)","v":""},{"$f":"IF('4.INGRESOS'!M38=\"\",\"\",'4.INGRESOS'!M38)","v":""},{"$f":"IF('4.INGRESOS'!N38=\"\",\"\",'4.INGRESOS'!N38)","v":""},{"$f":"IF('4.INGRESOS'!O38=\"\",\"\",'4.INGRESOS'!O38)","v":""},""]
[null,null,null,{"$f":"IF('4.INGRESOS'!C39=\"\",\"\",'4.INGRESOS'!C39)","v":""},{"$f":"IF('4.INGRESOS'!D39=\"\",\"\",'4.INGRESOS'!D39)","v":""},{"$f":"IF('4.INGRESOS'!E39=\"\",\"\",'4.INGRESOS'!E39)","v":""},{"$f":"IF('4.INGRESOS'!F39=\"\",\"\",'4.INGRESOS'!F39)","v":""},{"$f":"IF('4.INGRESOS'!G39=\"\",\"\",'4.INGRESOS'!G39)","v":""},{"$f":"IF('4.INGRESOS'!H39=\"\",\"\",'4.INGRESOS'!H39)","v":""},{"$f":"IF('4.INGRESOS'!I39=\"\",\"\",'4.INGRESOS'!I39)","v":""},{"$f":"IF('4.INGRESOS'!J39=\"\",\"\",'4.INGRESOS'!J39)","v":""},{"$f":"IF('4.INGRESOS'!K39=\"\",\"\",'4.INGRESOS'!K39)","v":""},{"$f":"IF('4.INGRESOS'!L39=\"\",\"\",'4.INGRESOS'!L39)","v":""},{"$f":"IF('4.INGRESOS'!M39=\"\",\"\",'4.INGRESOS'!M39)","v":""},{"$f":"IF('4.INGRESOS'!N39=\"\",\"\",'4.INGRESOS'!N39)","v":""},{"$f":"IF('4.INGRESOS'!O39=\"\",\"\",'4.INGRESOS'!O39)","v":""},""]
[null,null,null,{"$f":"IF('4.INGRESOS'!C40=\"\",\"\",'4.INGRESOS'!C40)","v":""},{"$f":"IF('4.INGRESOS'!D40=\"\",\"\",'4.INGRESOS'!D40)","v":""},{"$f":"IF('4.INGRESOS'!E40=\"\",\"\",'4.INGRESOS'!E40)","v":""},{"$f":"IF('4.INGRESOS'!F40=\"\",\"\",'4.INGRESOS'!F40)","v":""},{"$f":"IF('4.INGRESOS'!G40=\"\",\"\",'4.INGRESOS'!G40)","v":""},{"$f":"IF('4.INGRESOS'!H40=\"\",\"\",'4.INGRESOS'!H40)","v":""},{"$f":"IF('4.INGRESOS'!I40=\"\",\"\",'4.INGRESOS'!I40)","v":""},{"$f":"IF('4.INGRESOS'!J40=\"\",\"\",'4.INGRESOS'!J40)","v":""},{"$f":"IF('4.INGRESOS'!K40=\"\",\"\",'4.INGRESOS'!K40)","v":""},{"$f":"IF('4.INGRESOS'!L40=\"\",\"\",'4.INGRESOS'!L40)","v":""},{"$f":"IF('4.INGRESOS'!M40=\"\",\"\",'4.INGRESOS'!M40)","v":""},{"$f":"IF('4.INGRESOS'!N40=\"\",\"\",'4.INGRESOS'!N40)","v":""},{"$f":"IF('4.INGRESOS'!O40=\"\",\"\",'4.INGRESOS'!O40)","v":""},""]
[null,null,null,{"$f":"IF('4.INGRESOS'!C41=\"\",\"\",'4.INGRESOS'!C41)","v":""},{"$f":"IF('4.INGRESOS'!D41=\"\",\"\",'4.INGRESOS'!D41)","v":""},{"$f":"IF('4.INGRESOS'!E41=\"\",\"\",'4.INGRESOS'!E41)","v":""},{"$f":"IF('4.INGRESOS'!F41=\"\",\"\",'4.INGRESOS'!F41)","v":""},{"$f":"IF('4.INGRESOS'!G41=\"\",\"\",'4.INGRESOS'!G41)","v":""},{"$f":"IF('4.INGRESOS'!H41=\"\",\"\",'4.INGRESOS'!H41)","v":""},{"$f":"IF('4.INGRESOS'!I41=\"\",\"\",'4.INGRESOS'!I41)","v":""},{"$f":"IF('4.INGRESOS'!J41=\"\",\"\",'4.INGRESOS'!J41)","v":""},{"$f":"IF('4.INGRESOS'!K41=\"\",\"\",'4.INGRESOS'!K41)","v":""},{"$f":"IF('4.INGRESOS'!L41=\"\",\"\",'4.INGRESOS'!L41)","v":""},{"$f":"IF('4.INGRESOS'!M41=\"\",\"\",'4.INGRESOS'!M41)","v":""},{"$f":"IF('4.INGRESOS'!N41=\"\",\"\",'4.INGRESOS'!N41)","v":""},{"$f":"IF('4.INGRESOS'!O41=\"\",\"\",'4.INGRESOS'!O41)","v":""},""]
[null,null,null,{"$f":"IF('4.INGRESOS'!C42=\"\",\"\",'4.INGRESOS'!C42)","v":""},{"$f":"IF('4.INGRESOS'!D42=\"\",\"\",'4.INGRESOS'!D42)","v":""},{"$f":"IF('4.INGRESOS'!E42=\"\",\"\",'4.INGRESOS'!E42)","v":""},{"$f":"IF('4.INGRESOS'!F42=\"\",\"\",'4.INGRESOS'!F42)","v":""},{"$f":"IF('4.INGRESOS'!G42=\"\",\"\",'4.INGRESOS'!G42)","v":""},{"$f":"IF('4.INGRESOS'!H42=\"\",\"\",'4.INGRESOS'!H42)","v":""},{"$f":"IF('4.INGRESOS'!I42=\"\",\"\",'4.INGRESOS'!I42)","v":""},{"$f":"IF('4.INGRESOS'!J42=\"\",\"\",'4.INGRESOS'!J42)","v":""},{"$f":"IF('4.INGRESOS'!K42=\"\",\"\",'4.INGRESOS'!K42)","v":""},{"$f":"IF('4.INGRESOS'!L42=\"\",\"\",'4.INGRESOS'!L42)","v":""},{"$f":"IF('4.INGRESOS'!M42=\"\",\"\",'4.INGRESOS'!M42)","v":""},{"$f":"IF('4.INGRESOS'!N42=\"\",\"\",'4.INGRESOS'!N42)","v":""},{"$f":"IF('4.INGRESOS'!O42=\"\",\"\",'4.INGRESOS'!O42)","v":""},""]
[]
[]
[]
[]
[]
[]
[null,null,null,{"$f":"IF('4.INGRESOS'!C43=\"\",\"\",'4.INGRESOS'!C43)","v":""},{"$f":"IF('4.INGRESOS'!D43=\"\",\"\",'4.INGRESOS'!D43)","v":""},{"$f":"IF('4.INGRESOS'!E43=\"\",\"\",'4.INGRESOS'!E43)","v":""},{"$f":"IF('4.INGRESOS'!F43=\"\",\"\",'4.INGRESOS'!F43)","v":""},{"$f":"IF('4.INGRESOS'!G43=\"\",\"\",'4.INGRESOS'!G43)","v":""},{"$f":"IF('4.INGRESOS'!H43=\"\",\"\",'4.INGRESOS'!H43)","v":""},{"$f":"IF('4.INGRESOS'!I43=\"\",\"\",'4.INGRESOS'!I43)","v":""},{"$f":"IF('4.INGRESOS'!J43=\"\",\"\",'4.INGRESOS'!J43)","v":""},{"$f":"IF('4.INGRESOS'!K43=\"\",\"\",'4.INGRESOS'!K43)","v":""},{"$f":"IF('4.INGRESOS'!L43=\"\",\"\",'4.INGRESOS'!L43)","v":""},{"$f":"IF('4.INGRESOS'!M43=\"\",\"\",'4.INGRESOS'!M43)","v":""},{"$f":"IF('4.INGRESOS'!N43=\"\",\"\",'4.INGRESOS'!N43)","v":""},{"$f":"IF('4.INGRESOS'!O43=\"\",\"\",'4.INGRESOS'!O43)","v":""},""]
[null,null,null,{"$f":"IF('4.INGRESOS'!C44=\"\",\"\",'4.INGRESOS'!C44)","v":""},{"$f":"IF('4.INGRESOS'!D44=\"\",\"\",'4.INGRESOS'!D44)","v":""},{"$f":"IF('4.INGRESOS'!E44=\"\",\"\",'4.INGRESOS'!E44)","v":""},{"$f":"IF('4.INGRESOS'!F44=\"\",\"\",'4.INGRESOS'!F44)","v":""},{"$f":"IF('4.INGRESOS'!G44=\"\",\"\",'4.INGRESOS'!G44)","v":""},{"$f":"IF('4.INGRESOS'!H44=\"\",\"\",'4.INGRESOS'!H44)","v":""},{"$f":"IF('4.INGRESOS'!I44=\"\",\"\",'4.INGRESOS'!I44)","v":""},{"$f":"IF('4.INGRESOS'!J44=\"\",\"\",'4.INGRESOS'!J44)","v":""},{"$f":"IF('4.INGRESOS'!K44=\"\",\"\",'4.INGRESOS'!K44)","v":""},{"$f":"IF('4.INGRESOS'!L44=\"\",\"\",'4.INGRESOS'!L44)","v":""},{"$f":"IF('4.INGRESOS'!M44=\"\",\"\",'4.INGRESOS'!M44)","v":""},{"$f":"IF('4.INGRESOS'!N44=\"\",\"\",'4.INGRESOS'!N44)","v":""},{"$f":"IF('4.INGRESOS'!O44=\"\",\"\",'4.INGRESOS'!O44)","v":""},""]
[null,null,null,{"$f":"IF('4.INGRESOS'!C45=\"\",\"\",'4.INGRESOS'!C45)","v":""},{"$f":"IF('4.INGRESOS'!D45=\"\",\"\",'4.INGRESOS'!D45)","v":""},{"$f":"IF('4.INGRESOS'!E45=\"\",\"\",'4.INGRESOS'!E45)","v":""},{"$f":"IF('4.INGRESOS'!F45=\"\",\"\",'4.INGRESOS'!F45)","v":""},{"$f":"IF('4.INGRESOS'!G45=\"\",\"\",'4.INGRESOS'!G45)","v":""},{"$f":"IF('4.INGRESOS'!H45=\"\",\"\",'4.INGRESOS'!H45)","v":""},{"$f":"IF('4.INGRESOS'!I45=\"\",\"\",'4.INGRESOS'!I45)","v":""},{"$f":"IF('4.INGRESOS'!J45=\"\",\"\",'4.INGRESOS'!J45)","v":""},{"$f":"IF('4.INGRESOS'!K45=\"\",\"\",'4.INGRESOS'!K45)","v":""},{"$f":"IF('4.INGRESOS'!L45=\"\",\"\",'4.INGRESOS'!L45)","v":""},{"$f":"IF('4.INGRESOS'!M45=\"\",\"\",'4.INGRESOS'!M45)","v":""},{"$f":"IF('4.INGRESOS'!N45=\"\",\"\",'4.INGRESOS'!N45)","v":""},{"$f":"IF('4.INGRESOS'!O45=\"\",\"\",'4.INGRESOS'!O45)","v":""},""]
[null,null,null,{"$f":"IF('4.INGRESOS'!C46=\"\",\"\",'4.INGRESOS'!C46)","v":""},{"$f":"IF('4.INGRESOS'!D46=\"\",\"\",'4.INGRESOS'!D46)","v":""},{"$f":"IF('4.INGRESOS'!E46=\"\",\"\",'4.INGRESOS'!E46)","v":""},{"$f":"IF('4.INGRESOS'!F46=\"\",\"\",'4.INGRESOS'!F46)","v":""},{"$f":"IF('4.INGRESOS'!G46=\"\",\"\",'4.INGRESOS'!G46)","v":""},{"$f":"IF('4.INGRESOS'!H46=\"\",\"\",'4.INGRESOS'!H46)","v":""},{"$f":"IF('4.INGRESOS'!I46=\"\",\"\",'4.INGRESOS'!I46)","v":""},{"$f":"IF('4.INGRESOS'!J46=\"\",\"\",'4.INGRESOS'!J46)","v":""},{"$f":"IF('4.INGRESOS'!K46=\"\",\"\",'4.INGRESOS'!K46)","v":""},{"$f":"IF('4.INGRESOS'!L46=\"\",\"\",'4.INGRESOS'!L46)","v":""},{"$f":"IF('4.INGRESOS'!M46=\"\",\"\",'4.INGRESOS'!M46)","v":""},{"$f":"IF('4.INGRESOS'!N46=\"\",\"\",'4.INGRESOS'!N46)","v":""},{"$f":"IF('4.INGRESOS'!O46=\"\",\"\",'4.INGRESOS'!O46)","v":""},""]
[null,null,null,"TOTALES /MES ",{"$f":"+SUM(E12:E42)","v":0},{"$f":"+SUM(F12:F42)","v":0},0,0,0,0,0,0,0,0,0,0,0]
[]
[null,null,null,"otros ingresos ",{"$f":"E11","v":"1900enero"},"1900enero","1900febrero","1900marzo","1900abril","1900mayo","1900junio","1900julio","1900agosto","1900septiembre","1900octubre","1900noviembre","TOTALES "]
[null,null,null,{"$f":"IF('4.INGRESOS'!C53=\"\",\"\",'4.INGRESOS'!C53)","v":""},{"$f":"IF($D46=\"\",\"\",'4.INGRESOS'!D53)","v":""},{"$f":"IF($D46=\"\",\"\",'4.INGRESOS'!E53)","v":""},{"$f":"IF($D46=\"\",\"\",'4.INGRESOS'!F53)","v":""},{"$f":"IF($D46=\"\",\"\",'4.INGRESOS'!G53)","v":""},{"$f":"IF($D46=\"\",\"\",'4.INGRESOS'!H53)","v":""},{"$f":"IF($D46=\"\",\"\",'4.INGRESOS'!I53)","v":""},{"$f":"IF($D46=\"\",\"\",'4.INGRESOS'!J53)","v":""},{"$f":"IF($D46=\"\",\"\",'4.INGRESOS'!K53)","v":""},{"$f":"IF($D46=\"\",\"\",'4.INGRESOS'!L53)","v":""},{"$f":"IF($D46=\"\",\"\",'4.INGRESOS'!M53)","v":""},{"$f":"IF($D46=\"\",\"\",'4.INGRESOS'!N53)","v":""},{"$f":"IF($D46=\"\",\"\",'4.INGRESOS'!O53)","v":""},{"$f":"IF(D46=\"\",\"\",SUM(E46:P46))","v":""}]
[null,null,null,{"$f":"IF('4.INGRESOS'!C54=\"\",\"\",'4.INGRESOS'!C54)","v":""},{"$f":"IF($D47=\"\",\"\",'4.INGRESOS'!D54)","v":""},{"$f":"IF($D47=\"\",\"\",'4.INGRESOS'!E54)","v":""},{"$f":"IF($D47=\"\",\"\",'4.INGRESOS'!F54)","v":""},{"$f":"IF($D47=\"\",\"\",'4.INGRESOS'!G54)","v":""},{"$f":"IF($D47=\"\",\"\",'4.INGRESOS'!H54)","v":""},{"$f":"IF($D47=\"\",\"\",'4.INGRESOS'!I54)","v":""},{"$f":"IF($D47=\"\",\"\",'4.INGRESOS'!J54)","v":""},{"$f":"IF($D47=\"\",\"\",'4.INGRESOS'!K54)","v":""},{"$f":"IF($D47=\"\",\"\",'4.INGRESOS'!L54)","v":""},{"$f":"IF($D47=\"\",\"\",'4.INGRESOS'!M54)","v":""},{"$f":"IF($D47=\"\",\"\",'4.INGRESOS'!N54)","v":""},{"$f":"IF($D47=\"\",\"\",'4.INGRESOS'!O54)","v":""},{"$f":"IF(D47=\"\",\"\",SUM(E47:P47))","v":""}]
[null,null,null,{"$f":"IF('4.INGRESOS'!C55=\"\",\"\",'4.INGRESOS'!C55)","v":""},{"$f":"IF($D48=\"\",\"\",'4.INGRESOS'!D55)","v":""},{"$f":"IF($D48=\"\",\"\",'4.INGRESOS'!E55)","v":""},{"$f":"IF($D48=\"\",\"\",'4.INGRESOS'!F55)","v":""},{"$f":"IF($D48=\"\",\"\",'4.INGRESOS'!G55)","v":""},{"$f":"IF($D48=\"\",\"\",'4.INGRESOS'!H55)","v":""},{"$f":"IF($D48=\"\",\"\",'4.INGRESOS'!I55)","v":""},{"$f":"IF($D48=\"\",\"\",'4.INGRESOS'!J55)","v":""},{"$f":"IF($D48=\"\",\"\",'4.INGRESOS'!K55)","v":""},{"$f":"IF($D48=\"\",\"\",'4.INGRESOS'!L55)","v":""},{"$f":"IF($D48=\"\",\"\",'4.INGRESOS'!M55)","v":""},{"$f":"IF($D48=\"\",\"\",'4.INGRESOS'!N55)","v":""},{"$f":"IF($D48=\"\",\"\",'4.INGRESOS'!O55)","v":""},""]
[null,null,null,{"$f":"IF('4.INGRESOS'!C56=\"\",\"\",'4.INGRESOS'!C56)","v":""},{"$f":"IF($D49=\"\",\"\",'4.INGRESOS'!D56)","v":""},{"$f":"IF($D49=\"\",\"\",'4.INGRESOS'!E56)","v":""},{"$f":"IF($D49=\"\",\"\",'4.INGRESOS'!F56)","v":""},{"$f":"IF($D49=\"\",\"\",'4.INGRESOS'!G56)","v":""},{"$f":"IF($D49=\"\",\"\",'4.INGRESOS'!H56)","v":""},{"$f":"IF($D49=\"\",\"\",'4.INGRESOS'!I56)","v":""},{"$f":"IF($D49=\"\",\"\",'4.INGRESOS'!J56)","v":""},{"$f":"IF($D49=\"\",\"\",'4.INGRESOS'!K56)","v":""},{"$f":"IF($D49=\"\",\"\",'4.INGRESOS'!L56)","v":""},{"$f":"IF($D49=\"\",\"\",'4.INGRESOS'!M56)","v":""},{"$f":"IF($D49=\"\",\"\",'4.INGRESOS'!N56)","v":""},{"$f":"IF($D49=\"\",\"\",'4.INGRESOS'!O56)","v":""},{"$f":"IF(D49=\"\",\"\",SUM(E49:P49))","v":""}]
[null,null,null,{"$f":"IF('4.INGRESOS'!C57=\"\",\"\",'4.INGRESOS'!C57)","v":""},{"$f":"IF($D50=\"\",\"\",'4.INGRESOS'!D57)","v":""},{"$f":"IF($D50=\"\",\"\",'4.INGRESOS'!E57)","v":""},{"$f":"IF($D50=\"\",\"\",'4.INGRESOS'!F57)","v":""},{"$f":"IF($D50=\"\",\"\",'4.INGRESOS'!G57)","v":""},{"$f":"IF($D50=\"\",\"\",'4.INGRESOS'!H57)","v":""},{"$f":"IF($D50=\"\",\"\",'4.INGRESOS'!I57)","v":""},{"$f":"IF($D50=\"\",\"\",'4.INGRESOS'!J57)","v":""},{"$f":"IF($D50=\"\",\"\",'4.INGRESOS'!K57)","v":""},{"$f":"IF($D50=\"\",\"\",'4.INGRESOS'!L57)","v":""},{"$f":"IF($D50=\"\",\"\",'4.INGRESOS'!M57)","v":""},{"$f":"IF($D50=\"\",\"\",'4.INGRESOS'!N57)","v":""},{"$f":"IF($D50=\"\",\"\",'4.INGRESOS'!O57)","v":""},""]
[null,null,null,{"$f":"IF('4.INGRESOS'!C58=\"\",\"\",'4.INGRESOS'!C58)","v":""},{"$f":"IF($D51=\"\",\"\",'4.INGRESOS'!D58)","v":""},{"$f":"IF($D51=\"\",\"\",'4.INGRESOS'!E58)","v":""},{"$f":"IF($D51=\"\",\"\",'4.INGRESOS'!F58)","v":""},{"$f":"IF($D51=\"\",\"\",'4.INGRESOS'!G58)","v":""},{"$f":"IF($D51=\"\",\"\",'4.INGRESOS'!H58)","v":""},{"$f":"IF($D51=\"\",\"\",'4.INGRESOS'!I58)","v":""},{"$f":"IF($D51=\"\",\"\",'4.INGRESOS'!J58)","v":""},{"$f":"IF($D51=\"\",\"\",'4.INGRESOS'!K58)","v":""},{"$f":"IF($D51=\"\",\"\",'4.INGRESOS'!L58)","v":""},{"$f":"IF($D51=\"\",\"\",'4.INGRESOS'!M58)","v":""},{"$f":"IF($D51=\"\",\"\",'4.INGRESOS'!N58)","v":""},{"$f":"IF($D51=\"\",\"\",'4.INGRESOS'!O58)","v":""},""]
[null,null,null,{"$f":"IF('4.INGRESOS'!C59=\"\",\"\",'4.INGRESOS'!C59)","v":""},{"$f":"IF($D52=\"\",\"\",'4.INGRESOS'!D59)","v":""},{"$f":"IF($D52=\"\",\"\",'4.INGRESOS'!E59)","v":""},{"$f":"IF($D52=\"\",\"\",'4.INGRESOS'!F59)","v":""},{"$f":"IF($D52=\"\",\"\",'4.INGRESOS'!G59)","v":""},{"$f":"IF($D52=\"\",\"\",'4.INGRESOS'!H59)","v":""},{"$f":"IF($D52=\"\",\"\",'4.INGRESOS'!I59)","v":""},{"$f":"IF($D52=\"\",\"\",'4.INGRESOS'!J59)","v":""},{"$f":"IF($D52=\"\",\"\",'4.INGRESOS'!K59)","v":""},{"$f":"IF($D52=\"\",\"\",'4.INGRESOS'!L59)","v":""},{"$f":"IF($D52=\"\",\"\",'4.INGRESOS'!M59)","v":""},{"$f":"IF($D52=\"\",\"\",'4.INGRESOS'!N59)","v":""},{"$f":"IF($D52=\"\",\"\",'4.INGRESOS'!O59)","v":""},""]
[null,null,null,{"$f":"IF('4.INGRESOS'!C60=\"\",\"\",'4.INGRESOS'!C60)","v":""},{"$f":"IF($D53=\"\",\"\",'4.INGRESOS'!D60)","v":""},{"$f":"IF($D53=\"\",\"\",'4.INGRESOS'!E60)","v":""},{"$f":"IF($D53=\"\",\"\",'4.INGRESOS'!F60)","v":""},{"$f":"IF($D53=\"\",\"\",'4.INGRESOS'!G60)","v":""},{"$f":"IF($D53=\"\",\"\",'4.INGRESOS'!H60)","v":""},{"$f":"IF($D53=\"\",\"\",'4.INGRESOS'!I60)","v":""},{"$f":"IF($D53=\"\",\"\",'4.INGRESOS'!J60)","v":""},{"$f":"IF($D53=\"\",\"\",'4.INGRESOS'!K60)","v":""},{"$f":"IF($D53=\"\",\"\",'4.INGRESOS'!L60)","v":""},{"$f":"IF($D53=\"\",\"\",'4.INGRESOS'!M60)","v":""},{"$f":"IF($D53=\"\",\"\",'4.INGRESOS'!N60)","v":""},{"$f":"IF($D53=\"\",\"\",'4.INGRESOS'!O60)","v":""},""]
[null,null,null,{"$f":"IF('4.INGRESOS'!C61=\"\",\"\",'4.INGRESOS'!C61)","v":""},{"$f":"IF($D54=\"\",\"\",'4.INGRESOS'!D61)","v":""},{"$f":"IF($D54=\"\",\"\",'4.INGRESOS'!E61)","v":""},{"$f":"IF($D54=\"\",\"\",'4.INGRESOS'!F61)","v":""},{"$f":"IF($D54=\"\",\"\",'4.INGRESOS'!G61)","v":""},{"$f":"IF($D54=\"\",\"\",'4.INGRESOS'!H61)","v":""},{"$f":"IF($D54=\"\",\"\",'4.INGRESOS'!I61)","v":""},{"$f":"IF($D54=\"\",\"\",'4.INGRESOS'!J61)","v":""},{"$f":"IF($D54=\"\",\"\",'4.INGRESOS'!K61)","v":""},{"$f":"IF($D54=\"\",\"\",'4.INGRESOS'!L61)","v":""},{"$f":"IF($D54=\"\",\"\",'4.INGRESOS'!M61)","v":""},{"$f":"IF($D54=\"\",\"\",'4.INGRESOS'!N61)","v":""},{"$f":"IF($D54=\"\",\"\",'4.INGRESOS'!O61)","v":""},""]
[null,null,null,{"$f":"IF('4.INGRESOS'!C62=\"\",\"\",'4.INGRESOS'!C62)","v":""},{"$f":"IF($D55=\"\",\"\",'4.INGRESOS'!D62)","v":""},{"$f":"IF($D55=\"\",\"\",'4.INGRESOS'!E62)","v":""},{"$f":"IF($D55=\"\",\"\",'4.INGRESOS'!F62)","v":""},{"$f":"IF($D55=\"\",\"\",'4.INGRESOS'!G62)","v":""},{"$f":"IF($D55=\"\",\"\",'4.INGRESOS'!H62)","v":""},{"$f":"IF($D55=\"\",\"\",'4.INGRESOS'!I62)","v":""},{"$f":"IF($D55=\"\",\"\",'4.INGRESOS'!J62)","v":""},{"$f":"IF($D55=\"\",\"\",'4.INGRESOS'!K62)","v":""},{"$f":"IF($D55=\"\",\"\",'4.INGRESOS'!L62)","v":""},{"$f":"IF($D55=\"\",\"\",'4.INGRESOS'!M62)","v":""},{"$f":"IF($D55=\"\",\"\",'4.INGRESOS'!N62)","v":""},{"$f":"IF($D55=\"\",\"\",'4.INGRESOS'!O62)","v":""},""]
[null,null,null,"TOTAL /MES ",{"$f":"SUM(E46:E55)","v":0},0,0,0,0,0,0,0,0,0,0,0,0]
[]
[]
[null,"GASTOS FIJOS "]
[]
[null,null,null,null,{"$f":"E96","v":"1900enero"},{"$f":"F96","v":"1900enero"},"1900febrero","1900marzo","1900abril","1900mayo","1900junio","1900julio","1900agosto","1900septiembre","1900octubre","1900noviembre","TOTALES"]
[null,null,null,{"$f":"IF('ANEXO GASTOS FIJOS'!B13=\"\",\"\",'ANEXO GASTOS FIJOS'!B13)","v":"Amortizaciones"},{"$f":"IF('ANEXO GASTOS FIJOS'!D13=\"\",\"\",'ANEXO GASTOS FIJOS'!D13)","v":0},{"$f":"IF('ANEXO GASTOS FIJOS'!E13=\"\",\"\",'ANEXO GASTOS FIJOS'!E13)","v":0},{"$f":"IF('ANEXO GASTOS FIJOS'!F13=\"\",\"\",'ANEXO GASTOS FIJOS'!F13)","v":0},{"$f":"IF('ANEXO GASTOS FIJOS'!G13=\"\",\"\",'ANEXO GASTOS FIJOS'!G13)","v":0},{"$f":"IF('ANEXO GASTOS FIJOS'!H13=\"\",\"\",'ANEXO GASTOS FIJOS'!H13)","v":0},{"$f":"IF('ANEXO GASTOS FIJOS'!I13=\"\",\"\",'ANEXO GASTOS FIJOS'!I13)","v":0},{"$f":"IF('ANEXO GASTOS FIJOS'!J13=\"\",\"\",'ANEXO GASTOS FIJOS'!J13)","v":0},{"$f":"IF('ANEXO GASTOS FIJOS'!K13=\"\",\"\",'ANEXO GASTOS FIJOS'!K13)","v":0},{"$f":"IF('ANEXO GASTOS FIJOS'!L13=\"\",\"\",'ANEXO GASTOS FIJOS'!L13)","v":0},{"$f":"IF('ANEXO GASTOS FIJOS'!M13=\"\",\"\",'ANEXO GASTOS FIJOS'!M13)","v":0},{"$f":"IF('ANEXO GASTOS FIJOS'!N13=\"\",\"\",'ANEXO GASTOS FIJOS'!N13)","v":0},{"$f":"IF('ANEXO GASTOS FIJOS'!O13=\"\",\"\",'ANEXO GASTOS FIJOS'!O13)","v":0},{"$f":"IF(D62=\"\",\"\",SUM(E62:P62))","v":0}]
[null,null,null,{"$f":"IF('ANEXO GASTOS FIJOS'!B14=\"\",\"\",'ANEXO GASTOS FIJOS'!B14)","v":"Alquileres y cánones"},{"$f":"IF('ANEXO GASTOS FIJOS'!D14=\"\",\"\",'ANEXO GASTOS FIJOS'!D14)","v":""},{"$f":"IF('ANEXO GASTOS FIJOS'!E14=\"\",\"\",'ANEXO GASTOS FIJOS'!E14)","v":0},{"$f":"IF('ANEXO GASTOS FIJOS'!F14=\"\",\"\",'ANEXO GASTOS FIJOS'!F14)","v":0},{"$f":"IF('ANEXO GASTOS FIJOS'!G14=\"\",\"\",'ANEXO GASTOS FIJOS'!G14)","v":0},{"$f":"IF('ANEXO GASTOS FIJOS'!H14=\"\",\"\",'ANEXO GASTOS FIJOS'!H14)","v":0},{"$f":"IF('ANEXO GASTOS FIJOS'!I14=\"\",\"\",'ANEXO GASTOS FIJOS'!I14)","v":0},{"$f":"IF('ANEXO GASTOS FIJOS'!J14=\"\",\"\",'ANEXO GASTOS FIJOS'!J14)","v":0},{"$f":"IF('ANEXO GASTOS FIJOS'!K14=\"\",\"\",'ANEXO GASTOS FIJOS'!K14)","v":0},{"$f":"IF('ANEXO GASTOS FIJOS'!L14=\"\",\"\",'ANEXO GASTOS FIJOS'!L14)","v":0},{"$f":"IF('ANEXO GASTOS FIJOS'!M14=\"\",\"\",'ANEXO GASTOS FIJOS'!M14)","v":0},{"$f":"IF('ANEXO GASTOS FIJOS'!N14=\"\",\"\",'ANEXO GASTOS FIJOS'!N14)","v":0},{"$f":"IF('ANEXO GASTOS FIJOS'!O14=\"\",\"\",'ANEXO GASTOS FIJOS'!O14)","v":0},{"$f":"IF(D63=\"\",\"\",SUM(E63:P63))","v":0}]
[null,null,null,{"$f":"IF('ANEXO GASTOS FIJOS'!B15=\"\",\"\",'ANEXO GASTOS FIJOS'!B15)","v":"Renting"},{"$f":"IF('ANEXO GASTOS FIJOS'!D15=\"\",\"\",'ANEXO GASTOS FIJOS'!D15)","v":""},{"$f":"IF('ANEXO GASTOS FIJOS'!E15=\"\",\"\",'ANEXO GASTOS FIJOS'!E15)","v":0},{"$f":"IF('ANEXO GASTOS FIJOS'!F15=\"\",\"\",'ANEXO GASTOS FIJOS'!F15)","v":0},{"$f":"IF('ANEXO GASTOS FIJOS'!G15=\"\",\"\",'ANEXO GASTOS FIJOS'!G15)","v":0},{"$f":"IF('ANEXO GASTOS FIJOS'!H15=\"\",\"\",'ANEXO GASTOS FIJOS'!H15)","v":0},{"$f":"IF('ANEXO GASTOS FIJOS'!I15=\"\",\"\",'ANEXO GASTOS FIJOS'!I15)","v":0},{"$f":"IF('ANEXO GASTOS FIJOS'!J15=\"\",\"\",'ANEXO GASTOS FIJOS'!J15)","v":0},{"$f":"IF('ANEXO GASTOS FIJOS'!K15=\"\",\"\",'ANEXO GASTOS FIJOS'!K15)","v":0},{"$f":"IF('ANEXO GASTOS FIJOS'!L15=\"\",\"\",'ANEXO GASTOS FIJOS'!L15)","v":0},{"$f":"IF('ANEXO GASTOS FIJOS'!M15=\"\",\"\",'ANEXO GASTOS FIJOS'!M15)","v":0},{"$f":"IF('ANEXO GASTOS FIJOS'!N15=\"\",\"\",'ANEXO GASTOS FIJOS'!N15)","v":0},{"$f":"IF('ANEXO GASTOS FIJOS'!O15=\"\",\"\",'ANEXO GASTOS FIJOS'!O15)","v":0},0]
[null,null,null,{"$f":"IF('ANEXO GASTOS FIJOS'!B16=\"\",\"\",'ANEXO GASTOS FIJOS'!B16)","v":"Conservación (Mantenimiento y reparaciones)"},{"$f":"IF('ANEXO GASTOS FIJOS'!D16=\"\",\"\",'ANEXO GASTOS FIJOS'!D16)","v":""},{"$f":"IF('ANEXO GASTOS FIJOS'!E16=\"\",\"\",'ANEXO GASTOS FIJOS'!E16)","v":0},{"$f":"IF('ANEXO GASTOS FIJOS'!F16=\"\",\"\",'ANEXO GASTOS FIJOS'!F16)","v":0},{"$f":"IF('ANEXO GASTOS FIJOS'!G16=\"\",\"\",'ANEXO GASTOS FIJOS'!G16)","v":0},{"$f":"IF('ANEXO GASTOS FIJOS'!H16=\"\",\"\",'ANEXO GASTOS FIJOS'!H16)","v":0},{"$f":"IF('ANEXO GASTOS FIJOS'!I16=\"\",\"\",'ANEXO GASTOS FIJOS'!I16)","v":0},{"$f":"IF('ANEXO GASTOS FIJOS'!J16=\"\",\"\",'ANEXO GASTOS FIJOS'!J16)","v":0},{"$f":"IF('ANEXO GASTOS FIJOS'!K16=\"\",\"\",'ANEXO GASTOS FIJOS'!K16)","v":0},{"$f":"IF('ANEXO GASTOS FIJOS'!L16=\"\",\"\",'ANEXO GASTOS FIJOS'!L16)","v":0},{"$f":"IF('ANEXO GASTOS FIJOS'!M16=\"\",\"\",'ANEXO GASTOS FIJOS'!M16)","v":0},{"$f":"IF('ANEXO GASTOS FIJOS'!N16=\"\",\"\",'ANEXO GASTOS FIJOS'!N16)","v":0},{"$f":"IF('ANEXO GASTOS FIJOS'!O16=\"\",\"\",'ANEXO GASTOS FIJOS'!O16)","v":0},0]
[null,null,null,{"$f":"IF('ANEXO GASTOS FIJOS'!B17=\"\",\"\",'ANEXO GASTOS FIJOS'!B17)","v":"Servicios profesionales"},{"$f":"IF('ANEXO GASTOS FIJOS'!D17=\"\",\"\",'ANEXO GASTOS FIJOS'!D17)","v":""},{"$f":"IF('ANEXO GASTOS FIJOS'!E17=\"\",\"\",'ANEXO GASTOS FIJOS'!E17)","v":0},{"$f":"IF('ANEXO GASTOS FIJOS'!F17=\"\",\"\",'ANEXO GASTOS FIJOS'!F17)","v":0},{"$f":"IF('ANEXO GASTOS FIJOS'!G17=\"\",\"\",'ANEXO GASTOS FIJOS'!G17)","v":0},{"$f":"IF('ANEXO GASTOS FIJOS'!H17=\"\",\"\",'ANEXO GASTOS FIJOS'!H17)","v":0},{"$f":"IF('ANEXO GASTOS FIJOS'!I17=\"\",\"\",'ANEXO GASTOS FIJOS'!I17)","v":0},{"$f":"IF('ANEXO GASTOS FIJOS'!J17=\"\",\"\",'ANEXO GASTOS FIJOS'!J17)","v":0},{"$f":"IF('ANEXO GASTOS FIJOS'!K17=\"\",\"\",'ANEXO GASTOS FIJOS'!K17)","v":0},{"$f":"IF('ANEXO GASTOS FIJOS'!L17=\"\",\"\",'ANEXO GASTOS FIJOS'!L17)","v":0},{"$f":"IF('ANEXO GASTOS FIJOS'!M17=\"\",\"\",'ANEXO GASTOS FIJOS'!M17)","v":0},{"$f":"IF('ANEXO GASTOS FIJOS'!N17=\"\",\"\",'ANEXO GASTOS FIJOS'!N17)","v":0},{"$f":"IF('ANEXO GASTOS FIJOS'!O17=\"\",\"\",'ANEXO GASTOS FIJOS'!O17)","v":0},0]
[null,null,null,{"$f":"IF('ANEXO GASTOS FIJOS'!B18=\"\",\"\",'ANEXO GASTOS FIJOS'!B18)","v":"Transporte"},{"$f":"IF('ANEXO GASTOS FIJOS'!D18=\"\",\"\",'ANEXO GASTOS FIJOS'!D18)","v":""},{"$f":"IF('ANEXO GASTOS FIJOS'!E18=\"\",\"\",'ANEXO GASTOS FIJOS'!E18)","v":0},{"$f":"IF('ANEXO GASTOS FIJOS'!F18=\"\",\"\",'ANEXO GASTOS FIJOS'!F18)","v":0},{"$f":"IF('ANEXO GASTOS FIJOS'!G18=\"\",\"\",'ANEXO GASTOS FIJOS'!G18)","v":0},{"$f":"IF('ANEXO GASTOS FIJOS'!H18=\"\",\"\",'ANEXO GASTOS FIJOS'!H18)","v":0},{"$f":"IF('ANEXO GASTOS FIJOS'!I18=\"\",\"\",'ANEXO GASTOS FIJOS'!I18)","v":0},{"$f":"IF('ANEXO GASTOS FIJOS'!J18=\"\",\"\",'ANEXO GASTOS FIJOS'!J18)","v":0},{"$f":"IF('ANEXO GASTOS FIJOS'!K18=\"\",\"\",'ANEXO GASTOS FIJOS'!K18)","v":0},{"$f":"IF('ANEXO GASTOS FIJOS'!L18=\"\",\"\",'ANEXO GASTOS FIJOS'!L18)","v":0},{"$f":"IF('ANEXO GASTOS FIJOS'!M18=\"\",\"\",'ANEXO GASTOS FIJOS'!M18)","v":0},{"$f":"IF('ANEXO GASTOS FIJOS'!N18=\"\",\"\",'ANEXO GASTOS FIJOS'!N18)","v":0},{"$f":"IF('ANEXO GASTOS FIJOS'!O18=\"\",\"\",'ANEXO GASTOS FIJOS'!O18)","v":0},0]
[null,null,null,{"$f":"IF('ANEXO GASTOS FIJOS'!B19=\"\",\"\",'ANEXO GASTOS FIJOS'!B19)","v":"Seguros"},{"$f":"IF('ANEXO GASTOS FIJOS'!D19=\"\",\"\",'ANEXO GASTOS FIJOS'!D19)","v":""},{"$f":"IF('ANEXO GASTOS FIJOS'!E19=\"\",\"\",'ANEXO GASTOS FIJOS'!E19)","v":0},{"$f":"IF('ANEXO GASTOS FIJOS'!F19=\"\",\"\",'ANEXO GASTOS FIJOS'!F19)","v":0},{"$f":"IF('ANEXO GASTOS FIJOS'!G19=\"\",\"\",'ANEXO GASTOS FIJOS'!G19)","v":0},{"$f":"IF('ANEXO GASTOS FIJOS'!H19=\"\",\"\",'ANEXO GASTOS FIJOS'!H19)","v":0},{"$f":"IF('ANEXO GASTOS FIJOS'!I19=\"\",\"\",'ANEXO GASTOS FIJOS'!I19)","v":0},{"$f":"IF('ANEXO GASTOS FIJOS'!J19=\"\",\"\",'ANEXO GASTOS FIJOS'!J19)","v":0},{"$f":"IF('ANEXO GASTOS FIJOS'!K19=\"\",\"\",'ANEXO GASTOS FIJOS'!K19)","v":0},{"$f":"IF('ANEXO GASTOS FIJOS'!L19=\"\",\"\",'ANEXO GASTOS FIJOS'!L19)","v":0},{"$f":"IF('ANEXO GASTOS FIJOS'!M19=\"\",\"\",'ANEXO GASTOS FIJOS'!M19)","v":0},{"$f":"IF('ANEXO GASTOS FIJOS'!N19=\"\",\"\",'ANEXO GASTOS FIJOS'!N19)","v":0},{"$f":"IF('ANEXO GASTOS FIJOS'!O19=\"\",\"\",'ANEXO GASTOS FIJOS'!O19)","v":0},0]
[null,null,null,{"$f":"IF('ANEXO GASTOS FIJOS'!B20=\"\",\"\",'ANEXO GASTOS FIJOS'!B20)","v":"Gastos bancarios"},{"$f":"IF('ANEXO GASTOS FIJOS'!D20=\"\",\"\",'ANEXO GASTOS FIJOS'!D20)","v":""},{"$f":"IF('ANEXO GASTOS FIJOS'!E20=\"\",\"\",'ANEXO GASTOS FIJOS'!E20)","v":0},{"$f":"IF('ANEXO GASTOS FIJOS'!F20=\"\",\"\",'ANEXO GASTOS FIJOS'!F20)","v":0},{"$f":"IF('ANEXO GASTOS FIJOS'!G20=\"\",\"\",'ANEXO GASTOS FIJOS'!G20)","v":0},{"$f":"IF('ANEXO GASTOS FIJOS'!H20=\"\",\"\",'ANEXO GASTOS FIJOS'!H20)","v":0},{"$f":"IF('ANEXO GASTOS FIJOS'!I20=\"\",\"\",'ANEXO GASTOS FIJOS'!I20)","v":0},{"$f":"IF('ANEXO GASTOS FIJOS'!J20=\"\",\"\",'ANEXO GASTOS FIJOS'!J20)","v":0},{"$f":"IF('ANEXO GASTOS FIJOS'!K20=\"\",\"\",'ANEXO GASTOS FIJOS'!K20)","v":0},{"$f":"IF('ANEXO GASTOS FIJOS'!L20=\"\",\"\",'ANEXO GASTOS FIJOS'!L20)","v":0},{"$f":"IF('ANEXO GASTOS FIJOS'!M20=\"\",\"\",'ANEXO GASTOS FIJOS'!M20)","v":0},{"$f":"IF('ANEXO GASTOS FIJOS'!N20=\"\",\"\",'ANEXO GASTOS FIJOS'!N20)","v":0},{"$f":"IF('ANEXO GASTOS FIJOS'!O20=\"\",\"\",'ANEXO GASTOS FIJOS'!O20)","v":0},0]
[null,null,null,{"$f":"IF('ANEXO GASTOS FIJOS'!B21=\"\",\"\",'ANEXO GASTOS FIJOS'!B21)","v":"Publicidad y comunicación"},{"$f":"IF('ANEXO GASTOS FIJOS'!D21=\"\",\"\",'ANEXO GASTOS FIJOS'!D21)","v":""},{"$f":"IF('ANEXO GASTOS FIJOS'!E21=\"\",\"\",'ANEXO GASTOS FIJOS'!E21)","v":0},{"$f":"IF('ANEXO GASTOS FIJOS'!F21=\"\",\"\",'ANEXO GASTOS FIJOS'!F21)","v":0},{"$f":"IF('ANEXO GASTOS FIJOS'!G21=\"\",\"\",'ANEXO GASTOS FIJOS'!G21)","v":0},{"$f":"IF('ANEXO GASTOS FIJOS'!H21=\"\",\"\",'ANEXO GASTOS FIJOS'!H21)","v":0},{"$f":"IF('ANEXO GASTOS FIJOS'!I21=\"\",\"\",'ANEXO GASTOS FIJOS'!I21)","v":0},{"$f":"IF('ANEXO GASTOS FIJOS'!J21=\"\",\"\",'ANEXO GASTOS FIJOS'!J21)","v":0},{"$f":"IF('ANEXO GASTOS FIJOS'!K21=\"\",\"\",'ANEXO GASTOS FIJOS'!K21)","v":0},{"$f":"IF('ANEXO GASTOS FIJOS'!L21=\"\",\"\",'ANEXO GASTOS FIJOS'!L21)","v":0},{"$f":"IF('ANEXO GASTOS FIJOS'!M21=\"\",\"\",'ANEXO GASTOS FIJOS'!M21)","v":0},{"$f":"IF('ANEXO GASTOS FIJOS'!N21=\"\",\"\",'ANEXO GASTOS FIJOS'!N21)","v":0},{"$f":"IF('ANEXO GASTOS FIJOS'!O21=\"\",\"\",'ANEXO GASTOS FIJOS'!O21)","v":0},0]
[null,null,null,{"$f":"IF('ANEXO GASTOS FIJOS'!B22=\"\",\"\",'ANEXO GASTOS FIJOS'!B22)","v":"Electricidad"},{"$f":"IF('ANEXO GASTOS FIJOS'!D22=\"\",\"\",'ANEXO GASTOS FIJOS'!D22)","v":""},{"$f":"IF('ANEXO GASTOS FIJOS'!E22=\"\",\"\",'ANEXO GASTOS FIJOS'!E22)","v":0},{"$f":"IF('ANEXO GASTOS FIJOS'!F22=\"\",\"\",'ANEXO GASTOS FIJOS'!F22)","v":0},{"$f":"IF('ANEXO GASTOS FIJOS'!G22=\"\",\"\",'ANEXO GASTOS FIJOS'!G22)","v":0},{"$f":"IF('ANEXO GASTOS FIJOS'!H22=\"\",\"\",'ANEXO GASTOS FIJOS'!H22)","v":0},{"$f":"IF('ANEXO GASTOS FIJOS'!I22=\"\",\"\",'ANEXO GASTOS FIJOS'!I22)","v":0},{"$f":"IF('ANEXO GASTOS FIJOS'!J22=\"\",\"\",'ANEXO GASTOS FIJOS'!J22)","v":0},{"$f":"IF('ANEXO GASTOS FIJOS'!K22=\"\",\"\",'ANEXO GASTOS FIJOS'!K22)","v":0},{"$f":"IF('ANEXO GASTOS FIJOS'!L22=\"\",\"\",'ANEXO GASTOS FIJOS'!L22)","v":0},{"$f":"IF('ANEXO GASTOS FIJOS'!M22=\"\",\"\",'ANEXO GASTOS FIJOS'!M22)","v":0},{"$f":"IF('ANEXO GASTOS FIJOS'!N22=\"\",\"\",'ANEXO GASTOS FIJOS'!N22)","v":0},{"$f":"IF('ANEXO GASTOS FIJOS'!O22=\"\",\"\",'ANEXO GASTOS FIJOS'!O22)","v":0},0]
[null,null,null,{"$f":"IF('ANEXO GASTOS FIJOS'!B23=\"\",\"\",'ANEXO GASTOS FIJOS'!B23)","v":"Consumo de agua"},{"$f":"IF('ANEXO GASTOS FIJOS'!D23=\"\",\"\",'ANEXO GASTOS FIJOS'!D23)","v":0},{"$f":"IF('ANEXO GASTOS FIJOS'!E23=\"\",\"\",'ANEXO GASTOS FIJOS'!E23)","v":0},{"$f":"IF('ANEXO GASTOS FIJOS'!F23=\"\",\"\",'ANEXO GASTOS FIJOS'!F23)","v":0},{"$f":"IF('ANEXO GASTOS FIJOS'!G23=\"\",\"\",'ANEXO GASTOS FIJOS'!G23)","v":0},{"$f":"IF('ANEXO GASTOS FIJOS'!H23=\"\",\"\",'ANEXO GASTOS FIJOS'!H23)","v":0},{"$f":"IF('ANEXO GASTOS FIJOS'!I23=\"\",\"\",'ANEXO GASTOS FIJOS'!I23)","v":0},{"$f":"IF('ANEXO GASTOS FIJOS'!J23=\"\",\"\",'ANEXO GASTOS FIJOS'!J23)","v":0},{"$f":"IF('ANEXO GASTOS FIJOS'!K23=\"\",\"\",'ANEXO GASTOS FIJOS'!K23)","v":0},{"$f":"IF('ANEXO GASTOS FIJOS'!L23=\"\",\"\",'ANEXO GASTOS FIJOS'!L23)","v":0},{"$f":"IF('ANEXO GASTOS FIJOS'!M23=\"\",\"\",'ANEXO GASTOS FIJOS'!M23)","v":0},{"$f":"IF('ANEXO GASTOS FIJOS'!N23=\"\",\"\",'ANEXO GASTOS FIJOS'!N23)","v":0},{"$f":"IF('ANEXO GASTOS FIJOS'!O23=\"\",\"\",'ANEXO GASTOS FIJOS'!O23)","v":0},0]
[null,null,null,{"$f":"IF('ANEXO GASTOS FIJOS'!B24=\"\",\"\",'ANEXO GASTOS FIJOS'!B24)","v":"Telefonia Movil / Fija"},{"$f":"IF('ANEXO GASTOS FIJOS'!D24=\"\",\"\",'ANEXO GASTOS FIJOS'!D24)","v":""},{"$f":"IF('ANEXO GASTOS FIJOS'!E24=\"\",\"\",'ANEXO GASTOS FIJOS'!E24)","v":0},{"$f":"IF('ANEXO GASTOS FIJOS'!F24=\"\",\"\",'ANEXO GASTOS FIJOS'!F24)","v":0},{"$f":"IF('ANEXO GASTOS FIJOS'!G24=\"\",\"\",'ANEXO GASTOS FIJOS'!G24)","v":0},{"$f":"IF('ANEXO GASTOS FIJOS'!H24=\"\",\"\",'ANEXO GASTOS FIJOS'!H24)","v":0},{"$f":"IF('ANEXO GASTOS FIJOS'!I24=\"\",\"\",'ANEXO GASTOS FIJOS'!I24)","v":0},{"$f":"IF('ANEXO GASTOS FIJOS'!J24=\"\",\"\",'ANEXO GASTOS FIJOS'!J24)","v":0},{"$f":"IF('ANEXO GASTOS FIJOS'!K24=\"\",\"\",'ANEXO GASTOS FIJOS'!K24)","v":0},{"$f":"IF('ANEXO GASTOS FIJOS'!L24=\"\",\"\",'ANEXO GASTOS FIJOS'!L24)","v":0},{"$f":"IF('ANEXO GASTOS FIJOS'!M24=\"\",\"\",'ANEXO GASTOS FIJOS'!M24)","v":0},{"$f":"IF('ANEXO GASTOS FIJOS'!N24=\"\",\"\",'ANEXO GASTOS FIJOS'!N24)","v":0},{"$f":"IF('ANEXO GASTOS FIJOS'!O24=\"\",\"\",'ANEXO GASTOS FIJOS'!O24)","v":0},0]
[null,null,null,{"$f":"IF('ANEXO GASTOS FIJOS'!B25=\"\",\"\",'ANEXO GASTOS FIJOS'!B25)","v":"Internet"},{"$f":"IF('ANEXO GASTOS FIJOS'!D25=\"\",\"\",'ANEXO GASTOS FIJOS'!D25)","v":""},{"$f":"IF('ANEXO GASTOS FIJOS'!E25=\"\",\"\",'ANEXO GASTOS FIJOS'!E25)","v":0},{"$f":"IF('ANEXO GASTOS FIJOS'!F25=\"\",\"\",'ANEXO GASTOS FIJOS'!F25)","v":0},{"$f":"IF('ANEXO GASTOS FIJOS'!G25=\"\",\"\",'ANEXO GASTOS FIJOS'!G25)","v":0},{"$f":"IF('ANEXO GASTOS FIJOS'!H25=\"\",\"\",'ANEXO GASTOS FIJOS'!H25)","v":0},{"$f":"IF('ANEXO GASTOS FIJOS'!I25=\"\",\"\",'ANEXO GASTOS FIJOS'!I25)","v":0},{"$f":"IF('ANEXO GASTOS FIJOS'!J25=\"\",\"\",'ANEXO GASTOS FIJOS'!J25)","v":0},{"$f":"IF('ANEXO GASTOS FIJOS'!K25=\"\",\"\",'ANEXO GASTOS FIJOS'!K25)","v":0},{"$f":"IF('ANEXO GASTOS FIJOS'!L25=\"\",\"\",'ANEXO GASTOS FIJOS'!L25)","v":0},{"$f":"IF('ANEXO GASTOS FIJOS'!M25=\"\",\"\",'ANEXO GASTOS FIJOS'!M25)","v":0},{"$f":"IF('ANEXO GASTOS FIJOS'!N25=\"\",\"\",'ANEXO GASTOS FIJOS'!N25)","v":0},{"$f":"IF('ANEXO GASTOS FIJOS'!O25=\"\",\"\",'ANEXO GASTOS FIJOS'!O25)","v":0},0]
[null,null,null,{"$f":"IF('ANEXO GASTOS FIJOS'!B26=\"\",\"\",'ANEXO GASTOS FIJOS'!B26)","v":"Material de Oficina"},{"$f":"IF('ANEXO GASTOS FIJOS'!D26=\"\",\"\",'ANEXO GASTOS FIJOS'!D26)","v":""},{"$f":"IF('ANEXO GASTOS FIJOS'!E26=\"\",\"\",'ANEXO GASTOS FIJOS'!E26)","v":0},{"$f":"IF('ANEXO GASTOS FIJOS'!F26=\"\",\"\",'ANEXO GASTOS FIJOS'!F26)","v":0},{"$f":"IF('ANEXO GASTOS FIJOS'!G26=\"\",\"\",'ANEXO GASTOS FIJOS'!G26)","v":0},{"$f":"IF('ANEXO GASTOS FIJOS'!H26=\"\",\"\",'ANEXO GASTOS FIJOS'!H26)","v":0},{"$f":"IF('ANEXO GASTOS FIJOS'!I26=\"\",\"\",'ANEXO GASTOS FIJOS'!I26)","v":0},{"$f":"IF('ANEXO GASTOS FIJOS'!J26=\"\",\"\",'ANEXO GASTOS FIJOS'!J26)","v":0},{"$f":"IF('ANEXO GASTOS FIJOS'!K26=\"\",\"\",'ANEXO GASTOS FIJOS'!K26)","v":0},{"$f":"IF('ANEXO GASTOS FIJOS'!L26=\"\",\"\",'ANEXO GASTOS FIJOS'!L26)","v":0},{"$f":"IF('ANEXO GASTOS FIJOS'!M26=\"\",\"\",'ANEXO GASTOS FIJOS'!M26)","v":0},{"$f":"IF('ANEXO GASTOS FIJOS'!N26=\"\",\"\",'ANEXO GASTOS FIJOS'!N26)","v":0},{"$f":"IF('ANEXO GASTOS FIJOS'!O26=\"\",\"\",'ANEXO GASTOS FIJOS'!O26)","v":0},0]
[null,null,null,{"$f":"IF('ANEXO GASTOS FIJOS'!B27=\"\",\"\",'ANEXO GASTOS FIJOS'!B27)","v":"Sueldo bruto de los trabajadores autónomos"},{"$f":"IF('ANEXO GASTOS FIJOS'!D27=\"\",\"\",'ANEXO GASTOS FIJOS'!D27)","v":""},{"$f":"IF('ANEXO GASTOS FIJOS'!E27=\"\",\"\",'ANEXO GASTOS FIJOS'!E27)","v":0},{"$f":"IF('ANEXO GASTOS FIJOS'!F27=\"\",\"\",'ANEXO GASTOS FIJOS'!F27)","v":0},{"$f":"IF('ANEXO GASTOS FIJOS'!G27=\"\",\"\",'ANEXO GASTOS FIJOS'!G27)","v":0},{"$f":"IF('ANEXO GASTOS FIJOS'!H27=\"\",\"\",'ANEXO GASTOS FIJOS'!H27)","v":0},{"$f":"IF('ANEXO GASTOS FIJOS'!I27=\"\",\"\",'ANEXO GASTOS FIJOS'!I27)","v":0},{"$f":"IF('ANEXO GASTOS FIJOS'!J27=\"\",\"\",'ANEXO GASTOS FIJOS'!J27)","v":0},{"$f":"IF('ANEXO GASTOS FIJOS'!K27=\"\",\"\",'ANEXO GASTOS FIJOS'!K27)","v":0},{"$f":"IF('ANEXO GASTOS FIJOS'!L27=\"\",\"\",'ANEXO GASTOS FIJOS'!L27)","v":0},{"$f":"IF('ANEXO GASTOS FIJOS'!M27=\"\",\"\",'ANEXO GASTOS FIJOS'!M27)","v":0},{"$f":"IF('ANEXO GASTOS FIJOS'!N27=\"\",\"\",'ANEXO GASTOS FIJOS'!N27)","v":0},{"$f":"IF('ANEXO GASTOS FIJOS'!O27=\"\",\"\",'ANEXO GASTOS FIJOS'!O27)","v":0},0]
[null,null,null,{"$f":"IF('ANEXO GASTOS FIJOS'!B28=\"\",\"\",'ANEXO GASTOS FIJOS'!B28)","v":"Cotización a la Seguridad Social de los trabajadores autónomos"},{"$f":"IF('ANEXO GASTOS FIJOS'!D28=\"\",\"\",'ANEXO GASTOS FIJOS'!D28)","v":""},{"$f":"IF('ANEXO GASTOS FIJOS'!E28=\"\",\"\",'ANEXO GASTOS FIJOS'!E28)","v":0},{"$f":"IF('ANEXO GASTOS FIJOS'!F28=\"\",\"\",'ANEXO GASTOS FIJOS'!F28)","v":0},{"$f":"IF('ANEXO GASTOS FIJOS'!G28=\"\",\"\",'ANEXO GASTOS FIJOS'!G28)","v":0},{"$f":"IF('ANEXO GASTOS FIJOS'!H28=\"\",\"\",'ANEXO GASTOS FIJOS'!H28)","v":0},{"$f":"IF('ANEXO GASTOS FIJOS'!I28=\"\",\"\",'ANEXO GASTOS FIJOS'!I28)","v":0},{"$f":"IF('ANEXO GASTOS FIJOS'!J28=\"\",\"\",'ANEXO GASTOS FIJOS'!J28)","v":0},{"$f":"IF('ANEXO GASTOS FIJOS'!K28=\"\",\"\",'ANEXO GASTOS FIJOS'!K28)","v":0},{"$f":"IF('ANEXO GASTOS FIJOS'!L28=\"\",\"\",'ANEXO GASTOS FIJOS'!L28)","v":0},{"$f":"IF('ANEXO GASTOS FIJOS'!M28=\"\",\"\",'ANEXO GASTOS FIJOS'!M28)","v":0},{"$f":"IF('ANEXO GASTOS FIJOS'!N28=\"\",\"\",'ANEXO GASTOS FIJOS'!N28)","v":0},{"$f":"IF('ANEXO GASTOS FIJOS'!O28=\"\",\"\",'ANEXO GASTOS FIJOS'!O28)","v":0},0]
[null,null,null,{"$f":"IF('ANEXO GASTOS FIJOS'!B29=\"\",\"\",'ANEXO GASTOS FIJOS'!B29)","v":"Sueldo bruto de los trabajadores en régimen general"},{"$f":"IF('ANEXO GASTOS FIJOS'!D29=\"\",\"\",'ANEXO GASTOS FIJOS'!D29)","v":""},{"$f":"IF('ANEXO GASTOS FIJOS'!E29=\"\",\"\",'ANEXO GASTOS FIJOS'!E29)","v":0},{"$f":"IF('ANEXO GASTOS FIJOS'!F29=\"\",\"\",'ANEXO GASTOS FIJOS'!F29)","v":0},{"$f":"IF('ANEXO GASTOS FIJOS'!G29=\"\",\"\",'ANEXO GASTOS FIJOS'!G29)","v":0},{"$f":"IF('ANEXO GASTOS FIJOS'!H29=\"\",\"\",'ANEXO GASTOS FIJOS'!H29)","v":0},{"$f":"IF('ANEXO GASTOS FIJOS'!I29=\"\",\"\",'ANEXO GASTOS FIJOS'!I29)","v":0},{"$f":"IF('ANEXO GASTOS FIJOS'!J29=\"\",\"\",'ANEXO GASTOS FIJOS'!J29)","v":0},{"$f":"IF('ANEXO GASTOS FIJOS'!K29=\"\",\"\",'ANEXO GASTOS FIJOS'!K29)","v":0},{"$f":"IF('ANEXO GASTOS FIJOS'!L29=\"\",\"\",'ANEXO GASTOS FIJOS'!L29)","v":0},{"$f":"IF('ANEXO GASTOS FIJOS'!M29=\"\",\"\",'ANEXO GASTOS FIJOS'!M29)","v":0},{"$f":"IF('ANEXO GASTOS FIJOS'!N29=\"\",\"\",'ANEXO GASTOS FIJOS'!N29)","v":0},{"$f":"IF('ANEXO GASTOS FIJOS'!O29=\"\",\"\",'ANEXO GASTOS FIJOS'!O29)","v":0},0]
[null,null,null,{"$f":"IF('ANEXO GASTOS FIJOS'!B30=\"\",\"\",'ANEXO GASTOS FIJOS'!B30)","v":"Cotización a la Seguridad Social de los trabajadores en régimen general"},{"$f":"IF('ANEXO GASTOS FIJOS'!D30=\"\",\"\",'ANEXO GASTOS FIJOS'!D30)","v":""},{"$f":"IF('ANEXO GASTOS FIJOS'!E30=\"\",\"\",'ANEXO GASTOS FIJOS'!E30)","v":0},{"$f":"IF('ANEXO GASTOS FIJOS'!F30=\"\",\"\",'ANEXO GASTOS FIJOS'!F30)","v":0},{"$f":"IF('ANEXO GASTOS FIJOS'!G30=\"\",\"\",'ANEXO GASTOS FIJOS'!G30)","v":0},{"$f":"IF('ANEXO GASTOS FIJOS'!H30=\"\",\"\",'ANEXO GASTOS FIJOS'!H30)","v":0},{"$f":"IF('ANEXO GASTOS FIJOS'!I30=\"\",\"\",'ANEXO GASTOS FIJOS'!I30)","v":0},{"$f":"IF('ANEXO GASTOS FIJOS'!J30=\"\",\"\",'ANEXO GASTOS FIJOS'!J30)","v":0},{"$f":"IF('ANEXO GASTOS FIJOS'!K30=\"\",\"\",'ANEXO GASTOS FIJOS'!K30)","v":0},{"$f":"IF('ANEXO GASTOS FIJOS'!L30=\"\",\"\",'ANEXO GASTOS FIJOS'!L30)","v":0},{"$f":"IF('ANEXO GASTOS FIJOS'!M30=\"\",\"\",'ANEXO GASTOS FIJOS'!M30)","v":0},{"$f":"IF('ANEXO GASTOS FIJOS'!N30=\"\",\"\",'ANEXO GASTOS FIJOS'!N30)","v":0},{"$f":"IF('ANEXO GASTOS FIJOS'!O30=\"\",\"\",'ANEXO GASTOS FIJOS'!O30)","v":0},0]
[null,null,null,{"$f":"IF('ANEXO GASTOS FIJOS'!B31=\"\",\"\",'ANEXO GASTOS FIJOS'!B31)","v":"Retenciones IRPF"},{"$f":"IF('ANEXO GASTOS FIJOS'!D31=\"\",\"\",'ANEXO GASTOS FIJOS'!D31)","v":""},{"$f":"IF('ANEXO GASTOS FIJOS'!E31=\"\",\"\",'ANEXO GASTOS FIJOS'!E31)","v":0},{"$f":"IF('ANEXO GASTOS FIJOS'!F31=\"\",\"\",'ANEXO GASTOS FIJOS'!F31)","v":0},{"$f":"IF('ANEXO GASTOS FIJOS'!G31=\"\",\"\",'ANEXO GASTOS FIJOS'!G31)","v":0},{"$f":"IF('ANEXO GASTOS FIJOS'!H31=\"\",\"\",'ANEXO GASTOS FIJOS'!H31)","v":0},{"$f":"IF('ANEXO GASTOS FIJOS'!I31=\"\",\"\",'ANEXO GASTOS FIJOS'!I31)","v":0},{"$f":"IF('ANEXO GASTOS FIJOS'!J31=\"\",\"\",'ANEXO GASTOS FIJOS'!J31)","v":0},{"$f":"IF('ANEXO GASTOS FIJOS'!K31=\"\",\"\",'ANEXO GASTOS FIJOS'!K31)","v":0},{"$f":"IF('ANEXO GASTOS FIJOS'!L31=\"\",\"\",'ANEXO GASTOS FIJOS'!L31)","v":0},{"$f":"IF('ANEXO GASTOS FIJOS'!M31=\"\",\"\",'ANEXO GASTOS FIJOS'!M31)","v":0},{"$f":"IF('ANEXO GASTOS FIJOS'!N31=\"\",\"\",'ANEXO GASTOS FIJOS'!N31)","v":0},{"$f":"IF('ANEXO GASTOS FIJOS'!O31=\"\",\"\",'ANEXO GASTOS FIJOS'!O31)","v":0},0]
[null,null,null,{"$f":"IF('ANEXO GASTOS FIJOS'!B32=\"\",\"\",'ANEXO GASTOS FIJOS'!B32)","v":"Mantenimiento del riego "},{"$f":"IF('ANEXO GASTOS FIJOS'!D32=\"\",\"\",'ANEXO GASTOS FIJOS'!D32)","v":0},{"$f":"IF('ANEXO GASTOS FIJOS'!E32=\"\",\"\",'ANEXO GASTOS FIJOS'!E32)","v":0},{"$f":"IF('ANEXO GASTOS FIJOS'!F32=\"\",\"\",'ANEXO GASTOS FIJOS'!F32)","v":0},{"$f":"IF('ANEXO GASTOS FIJOS'!G32=\"\",\"\",'ANEXO GASTOS FIJOS'!G32)","v":0},{"$f":"IF('ANEXO GASTOS FIJOS'!H32=\"\",\"\",'ANEXO GASTOS FIJOS'!H32)","v":0},{"$f":"IF('ANEXO GASTOS FIJOS'!I32=\"\",\"\",'ANEXO GASTOS FIJOS'!I32)","v":0},{"$f":"IF('ANEXO GASTOS FIJOS'!J32=\"\",\"\",'ANEXO GASTOS FIJOS'!J32)","v":0},{"$f":"IF('ANEXO GASTOS FIJOS'!K32=\"\",\"\",'ANEXO GASTOS FIJOS'!K32)","v":0},{"$f":"IF('ANEXO GASTOS FIJOS'!L32=\"\",\"\",'ANEXO GASTOS FIJOS'!L32)","v":0},{"$f":"IF('ANEXO GASTOS FIJOS'!M32=\"\",\"\",'ANEXO GASTOS FIJOS'!M32)","v":0},{"$f":"IF('ANEXO GASTOS FIJOS'!N32=\"\",\"\",'ANEXO GASTOS FIJOS'!N32)","v":0},{"$f":"IF('ANEXO GASTOS FIJOS'!O32=\"\",\"\",'ANEXO GASTOS FIJOS'!O32)","v":0},0]
[null,null,null,{"$f":"IF('ANEXO GASTOS FIJOS'!B33=\"\",\"\",'ANEXO GASTOS FIJOS'!B33)","v":"Plantel "},{"$f":"IF('ANEXO GASTOS FIJOS'!D33=\"\",\"\",'ANEXO GASTOS FIJOS'!D33)","v":0},{"$f":"IF('ANEXO GASTOS FIJOS'!E33=\"\",\"\",'ANEXO GASTOS FIJOS'!E33)","v":0},{"$f":"IF('ANEXO GASTOS FIJOS'!F33=\"\",\"\",'ANEXO GASTOS FIJOS'!F33)","v":0},{"$f":"IF('ANEXO GASTOS FIJOS'!G33=\"\",\"\",'ANEXO GASTOS FIJOS'!G33)","v":0},{"$f":"IF('ANEXO GASTOS FIJOS'!H33=\"\",\"\",'ANEXO GASTOS FIJOS'!H33)","v":0},{"$f":"IF('ANEXO GASTOS FIJOS'!I33=\"\",\"\",'ANEXO GASTOS FIJOS'!I33)","v":0},{"$f":"IF('ANEXO GASTOS FIJOS'!J33=\"\",\"\",'ANEXO GASTOS FIJOS'!J33)","v":0},{"$f":"IF('ANEXO GASTOS FIJOS'!K33=\"\",\"\",'ANEXO GASTOS FIJOS'!K33)","v":0},{"$f":"IF('ANEXO GASTOS FIJOS'!L33=\"\",\"\",'ANEXO GASTOS FIJOS'!L33)","v":0},{"$f":"IF('ANEXO GASTOS FIJOS'!M33=\"\",\"\",'ANEXO GASTOS FIJOS'!M33)","v":0},{"$f":"IF('ANEXO GASTOS FIJOS'!N33=\"\",\"\",'ANEXO GASTOS FIJOS'!N33)","v":0},{"$f":"IF('ANEXO GASTOS FIJOS'!O33=\"\",\"\",'ANEXO GASTOS FIJOS'!O33)","v":0},0]
[null,null,null,{"$f":"IF('ANEXO GASTOS FIJOS'!B34=\"\",\"\",'ANEXO GASTOS FIJOS'!B34)","v":"Fitosanitarios "},{"$f":"IF('ANEXO GASTOS FIJOS'!D34=\"\",\"\",'ANEXO GASTOS FIJOS'!D34)","v":0},{"$f":"IF('ANEXO GASTOS FIJOS'!E34=\"\",\"\",'ANEXO GASTOS FIJOS'!E34)","v":0},{"$f":"IF('ANEXO GASTOS FIJOS'!F34=\"\",\"\",'ANEXO GASTOS FIJOS'!F34)","v":0},{"$f":"IF('ANEXO GASTOS FIJOS'!G34=\"\",\"\",'ANEXO GASTOS FIJOS'!G34)","v":0},{"$f":"IF('ANEXO GASTOS FIJOS'!H34=\"\",\"\",'ANEXO GASTOS FIJOS'!H34)","v":0},{"$f":"IF('ANEXO GASTOS FIJOS'!I34=\"\",\"\",'ANEXO GASTOS FIJOS'!I34)","v":0},{"$f":"IF('ANEXO GASTOS FIJOS'!J34=\"\",\"\",'ANEXO GASTOS FIJOS'!J34)","v":0},{"$f":"IF('ANEXO GASTOS FIJOS'!K34=\"\",\"\",'ANEXO GASTOS FIJOS'!K34)","v":0},{"$f":"IF('ANEXO GASTOS FIJOS'!L34=\"\",\"\",'ANEXO GASTOS FIJOS'!L34)","v":0},{"$f":"IF('ANEXO GASTOS FIJOS'!M34=\"\",\"\",'ANEXO GASTOS FIJOS'!M34)","v":0},{"$f":"IF('ANEXO GASTOS FIJOS'!N34=\"\",\"\",'ANEXO GASTOS FIJOS'!N34)","v":0},{"$f":"IF('ANEXO GASTOS FIJOS'!O34=\"\",\"\",'ANEXO GASTOS FIJOS'!O34)","v":0},0]
[null,null,null,{"$f":"IF('ANEXO GASTOS FIJOS'!B35=\"\",\"\",'ANEXO GASTOS FIJOS'!B35)","v":"Fertilizantes "},{"$f":"IF('ANEXO GASTOS FIJOS'!D35=\"\",\"\",'ANEXO GASTOS FIJOS'!D35)","v":0},{"$f":"IF('ANEXO GASTOS FIJOS'!E35=\"\",\"\",'ANEXO GASTOS FIJOS'!E35)","v":0},{"$f":"IF('ANEXO GASTOS FIJOS'!F35=\"\",\"\",'ANEXO GASTOS FIJOS'!F35)","v":0},{"$f":"IF('ANEXO GASTOS FIJOS'!G35=\"\",\"\",'ANEXO GASTOS FIJOS'!G35)","v":0},{"$f":"IF('ANEXO GASTOS FIJOS'!H35=\"\",\"\",'ANEXO GASTOS FIJOS'!H35)","v":0},{"$f":"IF('ANEXO GASTOS FIJOS'!I35=\"\",\"\",'ANEXO GASTOS FIJOS'!I35)","v":0},{"$f":"IF('ANEXO GASTOS FIJOS'!J35=\"\",\"\",'ANEXO GASTOS FIJOS'!J35)","v":0},{"$f":"IF('ANEXO GASTOS FIJOS'!K35=\"\",\"\",'ANEXO GASTOS FIJOS'!K35)","v":0},{"$f":"IF('ANEXO GASTOS FIJOS'!L35=\"\",\"\",'ANEXO GASTOS FIJOS'!L35)","v":0},{"$f":"IF('ANEXO GASTOS FIJOS'!M35=\"\",\"\",'ANEXO GASTOS FIJOS'!M35)","v":0},{"$f":"IF('ANEXO GASTOS FIJOS'!N35=\"\",\"\",'ANEXO GASTOS FIJOS'!N35)","v":0},{"$f":"IF('ANEXO GASTOS FIJOS'!O35=\"\",\"\",'ANEXO GASTOS FIJOS'!O35)","v":0},0]
[null,null,null,{"$f":"IF('ANEXO GASTOS FIJOS'!B36=\"\",\"\",'ANEXO GASTOS FIJOS'!B36)","v":""},{"$f":"IF('ANEXO GASTOS FIJOS'!D36=\"\",\"\",'ANEXO GASTOS FIJOS'!D36)","v":""},{"$f":"IF('ANEXO GASTOS FIJOS'!E36=\"\",\"\",'ANEXO GASTOS FIJOS'!E36)","v":""},{"$f":"IF('ANEXO GASTOS FIJOS'!F36=\"\",\"\",'ANEXO GASTOS FIJOS'!F36)","v":""},{"$f":"IF('ANEXO GASTOS FIJOS'!G36=\"\",\"\",'ANEXO GASTOS FIJOS'!G36)","v":""},{"$f":"IF('ANEXO GASTOS FIJOS'!H36=\"\",\"\",'ANEXO GASTOS FIJOS'!H36)","v":""},{"$f":"IF('ANEXO GASTOS FIJOS'!I36=\"\",\"\",'ANEXO GASTOS FIJOS'!I36)","v":""},{"$f":"IF('ANEXO GASTOS FIJOS'!J36=\"\",\"\",'ANEXO GASTOS FIJOS'!J36)","v":""},{"$f":"IF('ANEXO GASTOS FIJOS'!K36=\"\",\"\",'ANEXO GASTOS FIJOS'!K36)","v":""},{"$f":"IF('ANEXO GASTOS FIJOS'!L36=\"\",\"\",'ANEXO GASTOS FIJOS'!L36)","v":""},{"$f":"IF('ANEXO GASTOS FIJOS'!M36=\"\",\"\",'ANEXO GASTOS FIJOS'!M36)","v":""},{"$f":"IF('ANEXO GASTOS FIJOS'!N36=\"\",\"\",'ANEXO GASTOS FIJOS'!N36)","v":""},{"$f":"IF('ANEXO GASTOS FIJOS'!O36=\"\",\"\",'ANEXO GASTOS FIJOS'!O36)","v":""},""]
[null,null,null,{"$f":"IF('ANEXO GASTOS FIJOS'!B37=\"\",\"\",'ANEXO GASTOS FIJOS'!B37)","v":""},{"$f":"IF('ANEXO GASTOS FIJOS'!D37=\"\",\"\",'ANEXO GASTOS FIJOS'!D37)","v":""},{"$f":"IF('ANEXO GASTOS FIJOS'!E37=\"\",\"\",'ANEXO GASTOS FIJOS'!E37)","v":""},{"$f":"IF('ANEXO GASTOS FIJOS'!F37=\"\",\"\",'ANEXO GASTOS FIJOS'!F37)","v":""},{"$f":"IF('ANEXO GASTOS FIJOS'!G37=\"\",\"\",'ANEXO GASTOS FIJOS'!G37)","v":""},{"$f":"IF('ANEXO GASTOS FIJOS'!H37=\"\",\"\",'ANEXO GASTOS FIJOS'!H37)","v":""},{"$f":"IF('ANEXO GASTOS FIJOS'!I37=\"\",\"\",'ANEXO GASTOS FIJOS'!I37)","v":""},{"$f":"IF('ANEXO GASTOS FIJOS'!J37=\"\",\"\",'ANEXO GASTOS FIJOS'!J37)","v":""},{"$f":"IF('ANEXO GASTOS FIJOS'!K37=\"\",\"\",'ANEXO GASTOS FIJOS'!K37)","v":""},{"$f":"IF('ANEXO GASTOS FIJOS'!L37=\"\",\"\",'ANEXO GASTOS FIJOS'!L37)","v":""},{"$f":"IF('ANEXO GASTOS FIJOS'!M37=\"\",\"\",'ANEXO GASTOS FIJOS'!M37)","v":""},{"$f":"IF('ANEXO GASTOS FIJOS'!N37=\"\",\"\",'ANEXO GASTOS FIJOS'!N37)","v":""},{"$f":"IF('ANEXO GASTOS FIJOS'!O37=\"\",\"\",'ANEXO GASTOS FIJOS'!O37)","v":""},""]
[null,null,null,{"$f":"IF('ANEXO GASTOS FIJOS'!B38=\"\",\"\",'ANEXO GASTOS FIJOS'!B38)","v":""},{"$f":"IF('ANEXO GASTOS FIJOS'!D38=\"\",\"\",'ANEXO GASTOS FIJOS'!D38)","v":""},{"$f":"IF('ANEXO GASTOS FIJOS'!E38=\"\",\"\",'ANEXO GASTOS FIJOS'!E38)","v":""},{"$f":"IF('ANEXO GASTOS FIJOS'!F38=\"\",\"\",'ANEXO GASTOS FIJOS'!F38)","v":""},{"$f":"IF('ANEXO GASTOS FIJOS'!G38=\"\",\"\",'ANEXO GASTOS FIJOS'!G38)","v":""},{"$f":"IF('ANEXO GASTOS FIJOS'!H38=\"\",\"\",'ANEXO GASTOS FIJOS'!H38)","v":""},{"$f":"IF('ANEXO GASTOS FIJOS'!I38=\"\",\"\",'ANEXO GASTOS FIJOS'!I38)","v":""},{"$f":"IF('ANEXO GASTOS FIJOS'!J38=\"\",\"\",'ANEXO GASTOS FIJOS'!J38)","v":""},{"$f":"IF('ANEXO GASTOS FIJOS'!K38=\"\",\"\",'ANEXO GASTOS FIJOS'!K38)","v":""},{"$f":"IF('ANEXO GASTOS FIJOS'!L38=\"\",\"\",'ANEXO GASTOS FIJOS'!L38)","v":""},{"$f":"IF('ANEXO GASTOS FIJOS'!M38=\"\",\"\",'ANEXO GASTOS FIJOS'!M38)","v":""},{"$f":"IF('ANEXO GASTOS FIJOS'!N38=\"\",\"\",'ANEXO GASTOS FIJOS'!N38)","v":""},{"$f":"IF('ANEXO GASTOS FIJOS'!O38=\"\",\"\",'ANEXO GASTOS FIJOS'!O38)","v":""},""]
[null,null,null,"TOTALES / MES ",{"$f":"SUM(E62:E87)","v":0},{"$f":"SUM(F62:F87)","v":0},0,0,0,0,0,0,0,0,0,0,{"$f":"SUM(E88:P88)","v":0}]
[]
[]
[]
[]
[]
[null,"GASTOS VARIABLES "]
[]
[null,null,null,"TABLA A ",{"$f":"'7.CUENTA DE RESULTADOS '!C20","v":"1900enero"},{"$f":"'7.CUENTA DE RESULTADOS '!D20","v":"1900enero"},{"$f":"'7.CUENTA DE RESULTADOS '!E20","v":"1900febrero"},{"$f":"'7.CUENTA DE RESULTADOS '!F20","v":"1900marzo"},{"$f":"'7.CUENTA DE RESULTADOS '!G20","v":"1900abril"},{"$f":"'7.CUENTA DE RESULTADOS '!H20","v":"1900mayo"},{"$f":"'7.CUENTA DE RESULTADOS '!I20","v":"1900junio"},{"$f":"'7.CUENTA DE RESULTADOS '!J20","v":"1900julio"},{"$f":"'7.CUENTA DE RESULTADOS '!K20","v":"1900agosto"},{"$f":"'7.CUENTA DE RESULTADOS '!L20","v":"1900septiembre"},{"$f":"'7.CUENTA DE RESULTADOS '!M20","v":"1900octubre"},{"$f":"'7.CUENTA DE RESULTADOS '!N20","v":"1900noviembre"},"TOTALES "]
[null,null,null,{"$f":"IF('6.GASTOS VARIABLES'!C25=\"TOTAL\",\"\",IF('6.GASTOS VARIABLES'!C25=\"\",\"\",'6.GASTOS VARIABLES'!C25))","v":""},{"$f":"IF($D97=\"\",\"\",IF('6.GASTOS VARIABLES'!D25=\"\",\"\",'6.GASTOS VARIABLES'!D25))","v":""},{"$f":"IF($D97=\"\",\"\",IF('6.GASTOS VARIABLES'!E25=\"\",\"\",'6.GASTOS VARIABLES'!E25))","v":""},{"$f":"IF($D97=\"\",\"\",IF('6.GASTOS VARIABLES'!F25=\"\",\"\",'6.GASTOS VARIABLES'!F25))","v":""},{"$f":"IF($D97=\"\",\"\",IF('6.GASTOS VARIABLES'!G25=\"\",\"\",'6.GASTOS VARIABLES'!G25))","v":""},{"$f":"IF($D97=\"\",\"\",IF('6.GASTOS VARIABLES'!H25=\"\",\"\",'6.GASTOS VARIABLES'!H25))","v":""},{"$f":"IF($D97=\"\",\"\",IF('6.GASTOS VARIABLES'!I25=\"\",\"\",'6.GASTOS VARIABLES'!I25))","v":""},{"$f":"IF($D97=\"\",\"\",IF('6.GASTOS VARIABLES'!J25=\"\",\"\",'6.GASTOS VARIABLES'!J25))","v":""},{"$f":"IF($D97=\"\",\"\",IF('6.GASTOS VARIABLES'!K25=\"\",\"\",'6.GASTOS VARIABLES'!K25))","v":""},{"$f":"IF($D97=\"\",\"\",IF('6.GASTOS VARIABLES'!L25=\"\",\"\",'6.GASTOS VARIABLES'!L25))","v":""},{"$f":"IF($D97=\"\",\"\",IF('6.GASTOS VARIABLES'!M25=\"\",\"\",'6.GASTOS VARIABLES'!M25))","v":""},{"$f":"IF($D97=\"\",\"\",IF('6.GASTOS VARIABLES'!N25=\"\",\"\",'6.GASTOS VARIABLES'!N25))","v":""},{"$f":"IF($D97=\"\",\"\",IF('6.GASTOS VARIABLES'!O25=\"\",\"\",'6.GASTOS VARIABLES'!O25))","v":""},{"$f":"IF(D97=\"\",\"\",SUM(E97:P97))","v":""}]
[null,null,null,{"$f":"IF('6.GASTOS VARIABLES'!C26=\"TOTAL\",\"\",IF('6.GASTOS VARIABLES'!C26=\"\",\"\",'6.GASTOS VARIABLES'!C26))","v":""},{"$f":"IF($D98=\"\",\"\",IF('6.GASTOS VARIABLES'!D26=\"\",\"\",'6.GASTOS VARIABLES'!D26))","v":""},{"$f":"IF($D98=\"\",\"\",IF('6.GASTOS VARIABLES'!E26=\"\",\"\",'6.GASTOS VARIABLES'!E26))","v":""},{"$f":"IF($D98=\"\",\"\",IF('6.GASTOS VARIABLES'!F26=\"\",\"\",'6.GASTOS VARIABLES'!F26))","v":""},{"$f":"IF($D98=\"\",\"\",IF('6.GASTOS VARIABLES'!G26=\"\",\"\",'6.GASTOS VARIABLES'!G26))","v":""},{"$f":"IF($D98=\"\",\"\",IF('6.GASTOS VARIABLES'!H26=\"\",\"\",'6.GASTOS VARIABLES'!H26))","v":""},{"$f":"IF($D98=\"\",\"\",IF('6.GASTOS VARIABLES'!I26=\"\",\"\",'6.GASTOS VARIABLES'!I26))","v":""},{"$f":"IF($D98=\"\",\"\",IF('6.GASTOS VARIABLES'!J26=\"\",\"\",'6.GASTOS VARIABLES'!J26))","v":""},{"$f":"IF($D98=\"\",\"\",IF('6.GASTOS VARIABLES'!K26=\"\",\"\",'6.GASTOS VARIABLES'!K26))","v":""},{"$f":"IF($D98=\"\",\"\",IF('6.GASTOS VARIABLES'!L26=\"\",\"\",'6.GASTOS VARIABLES'!L26))","v":""},{"$f":"IF($D98=\"\",\"\",IF('6.GASTOS VARIABLES'!M26=\"\",\"\",'6.GASTOS VARIABLES'!M26))","v":""},{"$f":"IF($D98=\"\",\"\",IF('6.GASTOS VARIABLES'!N26=\"\",\"\",'6.GASTOS VARIABLES'!N26))","v":""},{"$f":"IF($D98=\"\",\"\",IF('6.GASTOS VARIABLES'!O26=\"\",\"\",'6.GASTOS VARIABLES'!O26))","v":""},{"$f":"IF(D98=\"\",\"\",SUM(E98:P98))","v":""}]
[null,null,null,{"$f":"IF('6.GASTOS VARIABLES'!C27=\"TOTAL\",\"\",IF('6.GASTOS VARIABLES'!C27=\"\",\"\",'6.GASTOS VARIABLES'!C27))","v":""},{"$f":"IF($D99=\"\",\"\",IF('6.GASTOS VARIABLES'!D27=\"\",\"\",'6.GASTOS VARIABLES'!D27))","v":""},{"$f":"IF($D99=\"\",\"\",IF('6.GASTOS VARIABLES'!E27=\"\",\"\",'6.GASTOS VARIABLES'!E27))","v":""},{"$f":"IF($D99=\"\",\"\",IF('6.GASTOS VARIABLES'!F27=\"\",\"\",'6.GASTOS VARIABLES'!F27))","v":""},{"$f":"IF($D99=\"\",\"\",IF('6.GASTOS VARIABLES'!G27=\"\",\"\",'6.GASTOS VARIABLES'!G27))","v":""},{"$f":"IF($D99=\"\",\"\",IF('6.GASTOS VARIABLES'!H27=\"\",\"\",'6.GASTOS VARIABLES'!H27))","v":""},{"$f":"IF($D99=\"\",\"\",IF('6.GASTOS VARIABLES'!I27=\"\",\"\",'6.GASTOS VARIABLES'!I27))","v":""},{"$f":"IF($D99=\"\",\"\",IF('6.GASTOS VARIABLES'!J27=\"\",\"\",'6.GASTOS VARIABLES'!J27))","v":""},{"$f":"IF($D99=\"\",\"\",IF('6.GASTOS VARIABLES'!K27=\"\",\"\",'6.GASTOS VARIABLES'!K27))","v":""},{"$f":"IF($D99=\"\",\"\",IF('6.GASTOS VARIABLES'!L27=\"\",\"\",'6.GASTOS VARIABLES'!L27))","v":""},{"$f":"IF($D99=\"\",\"\",IF('6.GASTOS VARIABLES'!M27=\"\",\"\",'6.GASTOS VARIABLES'!M27))","v":""},{"$f":"IF($D99=\"\",\"\",IF('6.GASTOS VARIABLES'!N27=\"\",\"\",'6.GASTOS VARIABLES'!N27))","v":""},{"$f":"IF($D99=\"\",\"\",IF('6.GASTOS VARIABLES'!O27=\"\",\"\",'6.GASTOS VARIABLES'!O27))","v":""},""]
[null,null,null,{"$f":"IF('6.GASTOS VARIABLES'!C28=\"TOTAL\",\"\",IF('6.GASTOS VARIABLES'!C28=\"\",\"\",'6.GASTOS VARIABLES'!C28))","v":""},{"$f":"IF($D100=\"\",\"\",IF('6.GASTOS VARIABLES'!D28=\"\",\"\",'6.GASTOS VARIABLES'!D28))","v":""},{"$f":"IF($D100=\"\",\"\",IF('6.GASTOS VARIABLES'!E28=\"\",\"\",'6.GASTOS VARIABLES'!E28))","v":""},{"$f":"IF($D100=\"\",\"\",IF('6.GASTOS VARIABLES'!F28=\"\",\"\",'6.GASTOS VARIABLES'!F28))","v":""},{"$f":"IF($D100=\"\",\"\",IF('6.GASTOS VARIABLES'!G28=\"\",\"\",'6.GASTOS VARIABLES'!G28))","v":""},{"$f":"IF($D100=\"\",\"\",IF('6.GASTOS VARIABLES'!H28=\"\",\"\",'6.GASTOS VARIABLES'!H28))","v":""},{"$f":"IF($D100=\"\",\"\",IF('6.GASTOS VARIABLES'!I28=\"\",\"\",'6.GASTOS VARIABLES'!I28))","v":""},{"$f":"IF($D100=\"\",\"\",IF('6.GASTOS VARIABLES'!J28=\"\",\"\",'6.GASTOS VARIABLES'!J28))","v":""},{"$f":"IF($D100=\"\",\"\",IF('6.GASTOS VARIABLES'!K28=\"\",\"\",'6.GASTOS VARIABLES'!K28))","v":""},{"$f":"IF($D100=\"\",\"\",IF('6.GASTOS VARIABLES'!L28=\"\",\"\",'6.GASTOS VARIABLES'!L28))","v":""},{"$f":"IF($D100=\"\",\"\",IF('6.GASTOS VARIABLES'!M28=\"\",\"\",'6.GASTOS VARIABLES'!M28))","v":""},{"$f":"IF($D100=\"\",\"\",IF('6.GASTOS VARIABLES'!N28=\"\",\"\",'6.GASTOS VARIABLES'!N28))","v":""},{"$f":"IF($D100=\"\",\"\",IF('6.GASTOS VARIABLES'!O28=\"\",\"\",'6.GASTOS VARIABLES'!O28))","v":""},""]
[null,null,null,{"$f":"IF('6.GASTOS VARIABLES'!C29=\"TOTAL\",\"\",IF('6.GASTOS VARIABLES'!C29=\"\",\"\",'6.GASTOS VARIABLES'!C29))","v":""},{"$f":"IF($D101=\"\",\"\",IF('6.GASTOS VARIABLES'!D29=\"\",\"\",'6.GASTOS VARIABLES'!D29))","v":""},{"$f":"IF($D101=\"\",\"\",IF('6.GASTOS VARIABLES'!E29=\"\",\"\",'6.GASTOS VARIABLES'!E29))","v":""},{"$f":"IF($D101=\"\",\"\",IF('6.GASTOS VARIABLES'!F29=\"\",\"\",'6.GASTOS VARIABLES'!F29))","v":""},{"$f":"IF($D101=\"\",\"\",IF('6.GASTOS VARIABLES'!G29=\"\",\"\",'6.GASTOS VARIABLES'!G29))","v":""},{"$f":"IF($D101=\"\",\"\",IF('6.GASTOS VARIABLES'!H29=\"\",\"\",'6.GASTOS VARIABLES'!H29))","v":""},{"$f":"IF($D101=\"\",\"\",IF('6.GASTOS VARIABLES'!I29=\"\",\"\",'6.GASTOS VARIABLES'!I29))","v":""},{"$f":"IF($D101=\"\",\"\",IF('6.GASTOS VARIABLES'!J29=\"\",\"\",'6.GASTOS VARIABLES'!J29))","v":""},{"$f":"IF($D101=\"\",\"\",IF('6.GASTOS VARIABLES'!K29=\"\",\"\",'6.GASTOS VARIABLES'!K29))","v":""},{"$f":"IF($D101=\"\",\"\",IF('6.GASTOS VARIABLES'!L29=\"\",\"\",'6.GASTOS VARIABLES'!L29))","v":""},{"$f":"IF($D101=\"\",\"\",IF('6.GASTOS VARIABLES'!M29=\"\",\"\",'6.GASTOS VARIABLES'!M29))","v":""},{"$f":"IF($D101=\"\",\"\",IF('6.GASTOS VARIABLES'!N29=\"\",\"\",'6.GASTOS VARIABLES'!N29))","v":""},{"$f":"IF($D101=\"\",\"\",IF('6.GASTOS VARIABLES'!O29=\"\",\"\",'6.GASTOS VARIABLES'!O29))","v":""},{"$f":"IF(D101=\"\",\"\",SUM(E101:P101))","v":""}]
[null,null,null,{"$f":"IF('6.GASTOS VARIABLES'!C30=\"TOTAL\",\"\",IF('6.GASTOS VARIABLES'!C30=\"\",\"\",'6.GASTOS VARIABLES'!C30))","v":""},{"$f":"IF($D102=\"\",\"\",IF('6.GASTOS VARIABLES'!D30=\"\",\"\",'6.GASTOS VARIABLES'!D30))","v":""},{"$f":"IF($D102=\"\",\"\",IF('6.GASTOS VARIABLES'!E30=\"\",\"\",'6.GASTOS VARIABLES'!E30))","v":""},{"$f":"IF($D102=\"\",\"\",IF('6.GASTOS VARIABLES'!F30=\"\",\"\",'6.GASTOS VARIABLES'!F30))","v":""},{"$f":"IF($D102=\"\",\"\",IF('6.GASTOS VARIABLES'!G30=\"\",\"\",'6.GASTOS VARIABLES'!G30))","v":""},{"$f":"IF($D102=\"\",\"\",IF('6.GASTOS VARIABLES'!H30=\"\",\"\",'6.GASTOS VARIABLES'!H30))","v":""},{"$f":"IF($D102=\"\",\"\",IF('6.GASTOS VARIABLES'!I30=\"\",\"\",'6.GASTOS VARIABLES'!I30))","v":""},{"$f":"IF($D102=\"\",\"\",IF('6.GASTOS VARIABLES'!J30=\"\",\"\",'6.GASTOS VARIABLES'!J30))","v":""},{"$f":"IF($D102=\"\",\"\",IF('6.GASTOS VARIABLES'!K30=\"\",\"\",'6.GASTOS VARIABLES'!K30))","v":""},{"$f":"IF($D102=\"\",\"\",IF('6.GASTOS VARIABLES'!L30=\"\",\"\",'6.GASTOS VARIABLES'!L30))","v":""},{"$f":"IF($D102=\"\",\"\",IF('6.GASTOS VARIABLES'!M30=\"\",\"\",'6.GASTOS VARIABLES'!M30))","v":""},{"$f":"IF($D102=\"\",\"\",IF('6.GASTOS VARIABLES'!N30=\"\",\"\",'6.GASTOS VARIABLES'!N30))","v":""},{"$f":"IF($D102=\"\",\"\",IF('6.GASTOS VARIABLES'!O30=\"\",\"\",'6.GASTOS VARIABLES'!O30))","v":""},""]
[null,null,null,{"$f":"IF('6.GASTOS VARIABLES'!C31=\"TOTAL\",\"\",IF('6.GASTOS VARIABLES'!C31=\"\",\"\",'6.GASTOS VARIABLES'!C31))","v":""},{"$f":"IF($D103=\"\",\"\",IF('6.GASTOS VARIABLES'!D31=\"\",\"\",'6.GASTOS VARIABLES'!D31))","v":""},{"$f":"IF($D103=\"\",\"\",IF('6.GASTOS VARIABLES'!E31=\"\",\"\",'6.GASTOS VARIABLES'!E31))","v":""},{"$f":"IF($D103=\"\",\"\",IF('6.GASTOS VARIABLES'!F31=\"\",\"\",'6.GASTOS VARIABLES'!F31))","v":""},{"$f":"IF($D103=\"\",\"\",IF('6.GASTOS VARIABLES'!G31=\"\",\"\",'6.GASTOS VARIABLES'!G31))","v":""},{"$f":"IF($D103=\"\",\"\",IF('6.GASTOS VARIABLES'!H31=\"\",\"\",'6.GASTOS VARIABLES'!H31))","v":""},{"$f":"IF($D103=\"\",\"\",IF('6.GASTOS VARIABLES'!I31=\"\",\"\",'6.GASTOS VARIABLES'!I31))","v":""},{"$f":"IF($D103=\"\",\"\",IF('6.GASTOS VARIABLES'!J31=\"\",\"\",'6.GASTOS VARIABLES'!J31))","v":""},{"$f":"IF($D103=\"\",\"\",IF('6.GASTOS VARIABLES'!K31=\"\",\"\",'6.GASTOS VARIABLES'!K31))","v":""},{"$f":"IF($D103=\"\",\"\",IF('6.GASTOS VARIABLES'!L31=\"\",\"\",'6.GASTOS VARIABLES'!L31))","v":""},{"$f":"IF($D103=\"\",\"\",IF('6.GASTOS VARIABLES'!M31=\"\",\"\",'6.GASTOS VARIABLES'!M31))","v":""},{"$f":"IF($D103=\"\",\"\",IF('6.GASTOS VARIABLES'!N31=\"\",\"\",'6.GASTOS VARIABLES'!N31))","v":""},{"$f":"IF($D103=\"\",\"\",IF('6.GASTOS VARIABLES'!O31=\"\",\"\",'6.GASTOS VARIABLES'!O31))","v":""},""]
[null,null,null,{"$f":"IF('6.GASTOS VARIABLES'!C32=\"TOTAL\",\"\",IF('6.GASTOS VARIABLES'!C32=\"\",\"\",'6.GASTOS VARIABLES'!C32))","v":""},{"$f":"IF($D104=\"\",\"\",IF('6.GASTOS VARIABLES'!D32=\"\",\"\",'6.GASTOS VARIABLES'!D32))","v":""},{"$f":"IF($D104=\"\",\"\",IF('6.GASTOS VARIABLES'!E32=\"\",\"\",'6.GASTOS VARIABLES'!E32))","v":""},{"$f":"IF($D104=\"\",\"\",IF('6.GASTOS VARIABLES'!F32=\"\",\"\",'6.GASTOS VARIABLES'!F32))","v":""},{"$f":"IF($D104=\"\",\"\",IF('6.GASTOS VARIABLES'!G32=\"\",\"\",'6.GASTOS VARIABLES'!G32))","v":""},{"$f":"IF($D104=\"\",\"\",IF('6.GASTOS VARIABLES'!H32=\"\",\"\",'6.GASTOS VARIABLES'!H32))","v":""},{"$f":"IF($D104=\"\",\"\",IF('6.GASTOS VARIABLES'!I32=\"\",\"\",'6.GASTOS VARIABLES'!I32))","v":""},{"$f":"IF($D104=\"\",\"\",IF('6.GASTOS VARIABLES'!J32=\"\",\"\",'6.GASTOS VARIABLES'!J32))","v":""},{"$f":"IF($D104=\"\",\"\",IF('6.GASTOS VARIABLES'!K32=\"\",\"\",'6.GASTOS VARIABLES'!K32))","v":""},{"$f":"IF($D104=\"\",\"\",IF('6.GASTOS VARIABLES'!L32=\"\",\"\",'6.GASTOS VARIABLES'!L32))","v":""},{"$f":"IF($D104=\"\",\"\",IF('6.GASTOS VARIABLES'!M32=\"\",\"\",'6.GASTOS VARIABLES'!M32))","v":""},{"$f":"IF($D104=\"\",\"\",IF('6.GASTOS VARIABLES'!N32=\"\",\"\",'6.GASTOS VARIABLES'!N32))","v":""},{"$f":"IF($D104=\"\",\"\",IF('6.GASTOS VARIABLES'!O32=\"\",\"\",'6.GASTOS VARIABLES'!O32))","v":""},""]
[null,null,null,{"$f":"IF('6.GASTOS VARIABLES'!C33=\"TOTAL\",\"\",IF('6.GASTOS VARIABLES'!C33=\"\",\"\",'6.GASTOS VARIABLES'!C33))","v":""},{"$f":"IF($D105=\"\",\"\",IF('6.GASTOS VARIABLES'!D33=\"\",\"\",'6.GASTOS VARIABLES'!D33))","v":""},{"$f":"IF($D105=\"\",\"\",IF('6.GASTOS VARIABLES'!E33=\"\",\"\",'6.GASTOS VARIABLES'!E33))","v":""},{"$f":"IF($D105=\"\",\"\",IF('6.GASTOS VARIABLES'!F33=\"\",\"\",'6.GASTOS VARIABLES'!F33))","v":""},{"$f":"IF($D105=\"\",\"\",IF('6.GASTOS VARIABLES'!G33=\"\",\"\",'6.GASTOS VARIABLES'!G33))","v":""},{"$f":"IF($D105=\"\",\"\",IF('6.GASTOS VARIABLES'!H33=\"\",\"\",'6.GASTOS VARIABLES'!H33))","v":""},{"$f":"IF($D105=\"\",\"\",IF('6.GASTOS VARIABLES'!I33=\"\",\"\",'6.GASTOS VARIABLES'!I33))","v":""},{"$f":"IF($D105=\"\",\"\",IF('6.GASTOS VARIABLES'!J33=\"\",\"\",'6.GASTOS VARIABLES'!J33))","v":""},{"$f":"IF($D105=\"\",\"\",IF('6.GASTOS VARIABLES'!K33=\"\",\"\",'6.GASTOS VARIABLES'!K33))","v":""},{"$f":"IF($D105=\"\",\"\",IF('6.GASTOS VARIABLES'!L33=\"\",\"\",'6.GASTOS VARIABLES'!L33))","v":""},{"$f":"IF($D105=\"\",\"\",IF('6.GASTOS VARIABLES'!M33=\"\",\"\",'6.GASTOS VARIABLES'!M33))","v":""},{"$f":"IF($D105=\"\",\"\",IF('6.GASTOS VARIABLES'!N33=\"\",\"\",'6.GASTOS VARIABLES'!N33))","v":""},{"$f":"IF($D105=\"\",\"\",IF('6.GASTOS VARIABLES'!O33=\"\",\"\",'6.GASTOS VARIABLES'!O33))","v":""},""]
[null,null,null,{"$f":"IF('6.GASTOS VARIABLES'!C34=\"TOTAL\",\"\",IF('6.GASTOS VARIABLES'!C34=\"\",\"\",'6.GASTOS VARIABLES'!C34))","v":""},{"$f":"IF($D106=\"\",\"\",IF('6.GASTOS VARIABLES'!D34=\"\",\"\",'6.GASTOS VARIABLES'!D34))","v":""},{"$f":"IF($D106=\"\",\"\",IF('6.GASTOS VARIABLES'!E34=\"\",\"\",'6.GASTOS VARIABLES'!E34))","v":""},{"$f":"IF($D106=\"\",\"\",IF('6.GASTOS VARIABLES'!F34=\"\",\"\",'6.GASTOS VARIABLES'!F34))","v":""},{"$f":"IF($D106=\"\",\"\",IF('6.GASTOS VARIABLES'!G34=\"\",\"\",'6.GASTOS VARIABLES'!G34))","v":""},{"$f":"IF($D106=\"\",\"\",IF('6.GASTOS VARIABLES'!H34=\"\",\"\",'6.GASTOS VARIABLES'!H34))","v":""},{"$f":"IF($D106=\"\",\"\",IF('6.GASTOS VARIABLES'!I34=\"\",\"\",'6.GASTOS VARIABLES'!I34))","v":""},{"$f":"IF($D106=\"\",\"\",IF('6.GASTOS VARIABLES'!J34=\"\",\"\",'6.GASTOS VARIABLES'!J34))","v":""},{"$f":"IF($D106=\"\",\"\",IF('6.GASTOS VARIABLES'!K34=\"\",\"\",'6.GASTOS VARIABLES'!K34))","v":""},{"$f":"IF($D106=\"\",\"\",IF('6.GASTOS VARIABLES'!L34=\"\",\"\",'6.GASTOS VARIABLES'!L34))","v":""},{"$f":"IF($D106=\"\",\"\",IF('6.GASTOS VARIABLES'!M34=\"\",\"\",'6.GASTOS VARIABLES'!M34))","v":""},{"$f":"IF($D106=\"\",\"\",IF('6.GASTOS VARIABLES'!N34=\"\",\"\",'6.GASTOS VARIABLES'!N34))","v":""},{"$f":"IF($D106=\"\",\"\",IF('6.GASTOS VARIABLES'!O34=\"\",\"\",'6.GASTOS VARIABLES'!O34))","v":""},""]
[null,null,null,{"$f":"IF('6.GASTOS VARIABLES'!C35=\"TOTAL\",\"\",IF('6.GASTOS VARIABLES'!C35=\"\",\"\",'6.GASTOS VARIABLES'!C35))","v":""},{"$f":"IF($D107=\"\",\"\",IF('6.GASTOS VARIABLES'!D35=\"\",\"\",'6.GASTOS VARIABLES'!D35))","v":""},{"$f":"IF($D107=\"\",\"\",IF('6.GASTOS VARIABLES'!E35=\"\",\"\",'6.GASTOS VARIABLES'!E35))","v":""},{"$f":"IF($D107=\"\",\"\",IF('6.GASTOS VARIABLES'!F35=\"\",\"\",'6.GASTOS VARIABLES'!F35))","v":""},{"$f":"IF($D107=\"\",\"\",IF('6.GASTOS VARIABLES'!G35=\"\",\"\",'6.GASTOS VARIABLES'!G35))","v":""},{"$f":"IF($D107=\"\",\"\",IF('6.GASTOS VARIABLES'!H35=\"\",\"\",'6.GASTOS VARIABLES'!H35))","v":""},{"$f":"IF($D107=\"\",\"\",IF('6.GASTOS VARIABLES'!I35=\"\",\"\",'6.GASTOS VARIABLES'!I35))","v":""},{"$f":"IF($D107=\"\",\"\",IF('6.GASTOS VARIABLES'!J35=\"\",\"\",'6.GASTOS VARIABLES'!J35))","v":""},{"$f":"IF($D107=\"\",\"\",IF('6.GASTOS VARIABLES'!K35=\"\",\"\",'6.GASTOS VARIABLES'!K35))","v":""},{"$f":"IF($D107=\"\",\"\",IF('6.GASTOS VARIABLES'!L35=\"\",\"\",'6.GASTOS VARIABLES'!L35))","v":""},{"$f":"IF($D107=\"\",\"\",IF('6.GASTOS VARIABLES'!M35=\"\",\"\",'6.GASTOS VARIABLES'!M35))","v":""},{"$f":"IF($D107=\"\",\"\",IF('6.GASTOS VARIABLES'!N35=\"\",\"\",'6.GASTOS VARIABLES'!N35))","v":""},{"$f":"IF($D107=\"\",\"\",IF('6.GASTOS VARIABLES'!O35=\"\",\"\",'6.GASTOS VARIABLES'!O35))","v":""},""]
[null,null,null,{"$f":"IF('6.GASTOS VARIABLES'!C36=\"TOTAL\",\"\",IF('6.GASTOS VARIABLES'!C36=\"\",\"\",'6.GASTOS VARIABLES'!C36))","v":""},{"$f":"IF($D108=\"\",\"\",IF('6.GASTOS VARIABLES'!D36=\"\",\"\",'6.GASTOS VARIABLES'!D36))","v":""},{"$f":"IF($D108=\"\",\"\",IF('6.GASTOS VARIABLES'!E36=\"\",\"\",'6.GASTOS VARIABLES'!E36))","v":""},{"$f":"IF($D108=\"\",\"\",IF('6.GASTOS VARIABLES'!F36=\"\",\"\",'6.GASTOS VARIABLES'!F36))","v":""},{"$f":"IF($D108=\"\",\"\",IF('6.GASTOS VARIABLES'!G36=\"\",\"\",'6.GASTOS VARIABLES'!G36))","v":""},{"$f":"IF($D108=\"\",\"\",IF('6.GASTOS VARIABLES'!H36=\"\",\"\",'6.GASTOS VARIABLES'!H36))","v":""},{"$f":"IF($D108=\"\",\"\",IF('6.GASTOS VARIABLES'!I36=\"\",\"\",'6.GASTOS VARIABLES'!I36))","v":""},{"$f":"IF($D108=\"\",\"\",IF('6.GASTOS VARIABLES'!J36=\"\",\"\",'6.GASTOS VARIABLES'!J36))","v":""},{"$f":"IF($D108=\"\",\"\",IF('6.GASTOS VARIABLES'!K36=\"\",\"\",'6.GASTOS VARIABLES'!K36))","v":""},{"$f":"IF($D108=\"\",\"\",IF('6.GASTOS VARIABLES'!L36=\"\",\"\",'6.GASTOS VARIABLES'!L36))","v":""},{"$f":"IF($D108=\"\",\"\",IF('6.GASTOS VARIABLES'!M36=\"\",\"\",'6.GASTOS VARIABLES'!M36))","v":""},{"$f":"IF($D108=\"\",\"\",IF('6.GASTOS VARIABLES'!N36=\"\",\"\",'6.GASTOS VARIABLES'!N36))","v":""},{"$f":"IF($D108=\"\",\"\",IF('6.GASTOS VARIABLES'!O36=\"\",\"\",'6.GASTOS VARIABLES'!O36))","v":""},""]
[null,null,null,{"$f":"IF('6.GASTOS VARIABLES'!C37=\"TOTAL\",\"\",IF('6.GASTOS VARIABLES'!C37=\"\",\"\",'6.GASTOS VARIABLES'!C37))","v":""},{"$f":"IF($D109=\"\",\"\",IF('6.GASTOS VARIABLES'!D37=\"\",\"\",'6.GASTOS VARIABLES'!D37))","v":""},{"$f":"IF($D109=\"\",\"\",IF('6.GASTOS VARIABLES'!E37=\"\",\"\",'6.GASTOS VARIABLES'!E37))","v":""},{"$f":"IF($D109=\"\",\"\",IF('6.GASTOS VARIABLES'!F37=\"\",\"\",'6.GASTOS VARIABLES'!F37))","v":""},{"$f":"IF($D109=\"\",\"\",IF('6.GASTOS VARIABLES'!G37=\"\",\"\",'6.GASTOS VARIABLES'!G37))","v":""},{"$f":"IF($D109=\"\",\"\",IF('6.GASTOS VARIABLES'!H37=\"\",\"\",'6.GASTOS VARIABLES'!H37))","v":""},{"$f":"IF($D109=\"\",\"\",IF('6.GASTOS VARIABLES'!I37=\"\",\"\",'6.GASTOS VARIABLES'!I37))","v":""},{"$f":"IF($D109=\"\",\"\",IF('6.GASTOS VARIABLES'!J37=\"\",\"\",'6.GASTOS VARIABLES'!J37))","v":""},{"$f":"IF($D109=\"\",\"\",IF('6.GASTOS VARIABLES'!K37=\"\",\"\",'6.GASTOS VARIABLES'!K37))","v":""},{"$f":"IF($D109=\"\",\"\",IF('6.GASTOS VARIABLES'!L37=\"\",\"\",'6.GASTOS VARIABLES'!L37))","v":""},{"$f":"IF($D109=\"\",\"\",IF('6.GASTOS VARIABLES'!M37=\"\",\"\",'6.GASTOS VARIABLES'!M37))","v":""},{"$f":"IF($D109=\"\",\"\",IF('6.GASTOS VARIABLES'!N37=\"\",\"\",'6.GASTOS VARIABLES'!N37))","v":""},{"$f":"IF($D109=\"\",\"\",IF('6.GASTOS VARIABLES'!O37=\"\",\"\",'6.GASTOS VARIABLES'!O37))","v":""},""]
[null,null,null,{"$f":"IF('6.GASTOS VARIABLES'!C38=\"TOTAL\",\"\",IF('6.GASTOS VARIABLES'!C38=\"\",\"\",'6.GASTOS VARIABLES'!C38))","v":""},{"$f":"IF($D110=\"\",\"\",IF('6.GASTOS VARIABLES'!D38=\"\",\"\",'6.GASTOS VARIABLES'!D38))","v":""},{"$f":"IF($D110=\"\",\"\",IF('6.GASTOS VARIABLES'!E38=\"\",\"\",'6.GASTOS VARIABLES'!E38))","v":""},{"$f":"IF($D110=\"\",\"\",IF('6.GASTOS VARIABLES'!F38=\"\",\"\",'6.GASTOS VARIABLES'!F38))","v":""},{"$f":"IF($D110=\"\",\"\",IF('6.GASTOS VARIABLES'!G38=\"\",\"\",'6.GASTOS VARIABLES'!G38))","v":""},{"$f":"IF($D110=\"\",\"\",IF('6.GASTOS VARIABLES'!H38=\"\",\"\",'6.GASTOS VARIABLES'!H38))","v":""},{"$f":"IF($D110=\"\",\"\",IF('6.GASTOS VARIABLES'!I38=\"\",\"\",'6.GASTOS VARIABLES'!I38))","v":""},{"$f":"IF($D110=\"\",\"\",IF('6.GASTOS VARIABLES'!J38=\"\",\"\",'6.GASTOS VARIABLES'!J38))","v":""},{"$f":"IF($D110=\"\",\"\",IF('6.GASTOS VARIABLES'!K38=\"\",\"\",'6.GASTOS VARIABLES'!K38))","v":""},{"$f":"IF($D110=\"\",\"\",IF('6.GASTOS VARIABLES'!L38=\"\",\"\",'6.GASTOS VARIABLES'!L38))","v":""},{"$f":"IF($D110=\"\",\"\",IF('6.GASTOS VARIABLES'!M38=\"\",\"\",'6.GASTOS VARIABLES'!M38))","v":""},{"$f":"IF($D110=\"\",\"\",IF('6.GASTOS VARIABLES'!N38=\"\",\"\",'6.GASTOS VARIABLES'!N38))","v":""},{"$f":"IF($D110=\"\",\"\",IF('6.GASTOS VARIABLES'!O38=\"\",\"\",'6.GASTOS VARIABLES'!O38))","v":""},""]
[null,null,null,{"$f":"IF('6.GASTOS VARIABLES'!C39=\"TOTAL\",\"\",IF('6.GASTOS VARIABLES'!C39=\"\",\"\",'6.GASTOS VARIABLES'!C39))","v":""},{"$f":"IF($D111=\"\",\"\",IF('6.GASTOS VARIABLES'!D39=\"\",\"\",'6.GASTOS VARIABLES'!D39))","v":""},{"$f":"IF($D111=\"\",\"\",IF('6.GASTOS VARIABLES'!E39=\"\",\"\",'6.GASTOS VARIABLES'!E39))","v":""},{"$f":"IF($D111=\"\",\"\",IF('6.GASTOS VARIABLES'!F39=\"\",\"\",'6.GASTOS VARIABLES'!F39))","v":""},{"$f":"IF($D111=\"\",\"\",IF('6.GASTOS VARIABLES'!G39=\"\",\"\",'6.GASTOS VARIABLES'!G39))","v":""},{"$f":"IF($D111=\"\",\"\",IF('6.GASTOS VARIABLES'!H39=\"\",\"\",'6.GASTOS VARIABLES'!H39))","v":""},{"$f":"IF($D111=\"\",\"\",IF('6.GASTOS VARIABLES'!I39=\"\",\"\",'6.GASTOS VARIABLES'!I39))","v":""},{"$f":"IF($D111=\"\",\"\",IF('6.GASTOS VARIABLES'!J39=\"\",\"\",'6.GASTOS VARIABLES'!J39))","v":""},{"$f":"IF($D111=\"\",\"\",IF('6.GASTOS VARIABLES'!K39=\"\",\"\",'6.GASTOS VARIABLES'!K39))","v":""},{"$f":"IF($D111=\"\",\"\",IF('6.GASTOS VARIABLES'!L39=\"\",\"\",'6.GASTOS VARIABLES'!L39))","v":""},{"$f":"IF($D111=\"\",\"\",IF('6.GASTOS VARIABLES'!M39=\"\",\"\",'6.GASTOS VARIABLES'!M39))","v":""},{"$f":"IF($D111=\"\",\"\",IF('6.GASTOS VARIABLES'!N39=\"\",\"\",'6.GASTOS VARIABLES'!N39))","v":""},{"$f":"IF($D111=\"\",\"\",IF('6.GASTOS VARIABLES'!O39=\"\",\"\",'6.GASTOS VARIABLES'!O39))","v":""},""]
[null,null,null,{"$f":"IF('6.GASTOS VARIABLES'!C40=\"TOTAL\",\"\",IF('6.GASTOS VARIABLES'!C40=\"\",\"\",'6.GASTOS VARIABLES'!C40))","v":""},{"$f":"IF($D112=\"\",\"\",IF('6.GASTOS VARIABLES'!D40=\"\",\"\",'6.GASTOS VARIABLES'!D40))","v":""},{"$f":"IF($D112=\"\",\"\",IF('6.GASTOS VARIABLES'!E40=\"\",\"\",'6.GASTOS VARIABLES'!E40))","v":""},{"$f":"IF($D112=\"\",\"\",IF('6.GASTOS VARIABLES'!F40=\"\",\"\",'6.GASTOS VARIABLES'!F40))","v":""},{"$f":"IF($D112=\"\",\"\",IF('6.GASTOS VARIABLES'!G40=\"\",\"\",'6.GASTOS VARIABLES'!G40))","v":""},{"$f":"IF($D112=\"\",\"\",IF('6.GASTOS VARIABLES'!H40=\"\",\"\",'6.GASTOS VARIABLES'!H40))","v":""},{"$f":"IF($D112=\"\",\"\",IF('6.GASTOS VARIABLES'!I40=\"\",\"\",'6.GASTOS VARIABLES'!I40))","v":""},{"$f":"IF($D112=\"\",\"\",IF('6.GASTOS VARIABLES'!J40=\"\",\"\",'6.GASTOS VARIABLES'!J40))","v":""},{"$f":"IF($D112=\"\",\"\",IF('6.GASTOS VARIABLES'!K40=\"\",\"\",'6.GASTOS VARIABLES'!K40))","v":""},{"$f":"IF($D112=\"\",\"\",IF('6.GASTOS VARIABLES'!L40=\"\",\"\",'6.GASTOS VARIABLES'!L40))","v":""},{"$f":"IF($D112=\"\",\"\",IF('6.GASTOS VARIABLES'!M40=\"\",\"\",'6.GASTOS VARIABLES'!M40))","v":""},{"$f":"IF($D112=\"\",\"\",IF('6.GASTOS VARIABLES'!N40=\"\",\"\",'6.GASTOS VARIABLES'!N40))","v":""},{"$f":"IF($D112=\"\",\"\",IF('6.GASTOS VARIABLES'!O40=\"\",\"\",'6.GASTOS VARIABLES'!O40))","v":""},""]
[null,null,null,{"$f":"IF('6.GASTOS VARIABLES'!C41=\"TOTAL\",\"\",IF('6.GASTOS VARIABLES'!C41=\"\",\"\",'6.GASTOS VARIABLES'!C41))","v":""},{"$f":"IF($D113=\"\",\"\",IF('6.GASTOS VARIABLES'!D41=\"\",\"\",'6.GASTOS VARIABLES'!D41))","v":""},{"$f":"IF($D113=\"\",\"\",IF('6.GASTOS VARIABLES'!E41=\"\",\"\",'6.GASTOS VARIABLES'!E41))","v":""},{"$f":"IF($D113=\"\",\"\",IF('6.GASTOS VARIABLES'!F41=\"\",\"\",'6.GASTOS VARIABLES'!F41))","v":""},{"$f":"IF($D113=\"\",\"\",IF('6.GASTOS VARIABLES'!G41=\"\",\"\",'6.GASTOS VARIABLES'!G41))","v":""},{"$f":"IF($D113=\"\",\"\",IF('6.GASTOS VARIABLES'!H41=\"\",\"\",'6.GASTOS VARIABLES'!H41))","v":""},{"$f":"IF($D113=\"\",\"\",IF('6.GASTOS VARIABLES'!I41=\"\",\"\",'6.GASTOS VARIABLES'!I41))","v":""},{"$f":"IF($D113=\"\",\"\",IF('6.GASTOS VARIABLES'!J41=\"\",\"\",'6.GASTOS VARIABLES'!J41))","v":""},{"$f":"IF($D113=\"\",\"\",IF('6.GASTOS VARIABLES'!K41=\"\",\"\",'6.GASTOS VARIABLES'!K41))","v":""},{"$f":"IF($D113=\"\",\"\",IF('6.GASTOS VARIABLES'!L41=\"\",\"\",'6.GASTOS VARIABLES'!L41))","v":""},{"$f":"IF($D113=\"\",\"\",IF('6.GASTOS VARIABLES'!M41=\"\",\"\",'6.GASTOS VARIABLES'!M41))","v":""},{"$f":"IF($D113=\"\",\"\",IF('6.GASTOS VARIABLES'!N41=\"\",\"\",'6.GASTOS VARIABLES'!N41))","v":""},{"$f":"IF($D113=\"\",\"\",IF('6.GASTOS VARIABLES'!O41=\"\",\"\",'6.GASTOS VARIABLES'!O41))","v":""},""]
[null,null,null,{"$f":"IF('6.GASTOS VARIABLES'!C42=\"TOTAL\",\"\",IF('6.GASTOS VARIABLES'!C42=\"\",\"\",'6.GASTOS VARIABLES'!C42))","v":""},{"$f":"IF($D114=\"\",\"\",IF('6.GASTOS VARIABLES'!D42=\"\",\"\",'6.GASTOS VARIABLES'!D42))","v":""},{"$f":"IF($D114=\"\",\"\",IF('6.GASTOS VARIABLES'!E42=\"\",\"\",'6.GASTOS VARIABLES'!E42))","v":""},{"$f":"IF($D114=\"\",\"\",IF('6.GASTOS VARIABLES'!F42=\"\",\"\",'6.GASTOS VARIABLES'!F42))","v":""},{"$f":"IF($D114=\"\",\"\",IF('6.GASTOS VARIABLES'!G42=\"\",\"\",'6.GASTOS VARIABLES'!G42))","v":""},{"$f":"IF($D114=\"\",\"\",IF('6.GASTOS VARIABLES'!H42=\"\",\"\",'6.GASTOS VARIABLES'!H42))","v":""},{"$f":"IF($D114=\"\",\"\",IF('6.GASTOS VARIABLES'!I42=\"\",\"\",'6.GASTOS VARIABLES'!I42))","v":""},{"$f":"IF($D114=\"\",\"\",IF('6.GASTOS VARIABLES'!J42=\"\",\"\",'6.GASTOS VARIABLES'!J42))","v":""},{"$f":"IF($D114=\"\",\"\",IF('6.GASTOS VARIABLES'!K42=\"\",\"\",'6.GASTOS VARIABLES'!K42))","v":""},{"$f":"IF($D114=\"\",\"\",IF('6.GASTOS VARIABLES'!L42=\"\",\"\",'6.GASTOS VARIABLES'!L42))","v":""},{"$f":"IF($D114=\"\",\"\",IF('6.GASTOS VARIABLES'!M42=\"\",\"\",'6.GASTOS VARIABLES'!M42))","v":""},{"$f":"IF($D114=\"\",\"\",IF('6.GASTOS VARIABLES'!N42=\"\",\"\",'6.GASTOS VARIABLES'!N42))","v":""},{"$f":"IF($D114=\"\",\"\",IF('6.GASTOS VARIABLES'!O42=\"\",\"\",'6.GASTOS VARIABLES'!O42))","v":""},""]
[null,null,null,{"$f":"IF('6.GASTOS VARIABLES'!C43=\"TOTAL\",\"\",IF('6.GASTOS VARIABLES'!C43=\"\",\"\",'6.GASTOS VARIABLES'!C43))","v":""},{"$f":"IF($D115=\"\",\"\",IF('6.GASTOS VARIABLES'!D43=\"\",\"\",'6.GASTOS VARIABLES'!D43))","v":""},{"$f":"IF($D115=\"\",\"\",IF('6.GASTOS VARIABLES'!E43=\"\",\"\",'6.GASTOS VARIABLES'!E43))","v":""},{"$f":"IF($D115=\"\",\"\",IF('6.GASTOS VARIABLES'!F43=\"\",\"\",'6.GASTOS VARIABLES'!F43))","v":""},{"$f":"IF($D115=\"\",\"\",IF('6.GASTOS VARIABLES'!G43=\"\",\"\",'6.GASTOS VARIABLES'!G43))","v":""},{"$f":"IF($D115=\"\",\"\",IF('6.GASTOS VARIABLES'!H43=\"\",\"\",'6.GASTOS VARIABLES'!H43))","v":""},{"$f":"IF($D115=\"\",\"\",IF('6.GASTOS VARIABLES'!I43=\"\",\"\",'6.GASTOS VARIABLES'!I43))","v":""},{"$f":"IF($D115=\"\",\"\",IF('6.GASTOS VARIABLES'!J43=\"\",\"\",'6.GASTOS VARIABLES'!J43))","v":""},{"$f":"IF($D115=\"\",\"\",IF('6.GASTOS VARIABLES'!K43=\"\",\"\",'6.GASTOS VARIABLES'!K43))","v":""},{"$f":"IF($D115=\"\",\"\",IF('6.GASTOS VARIABLES'!L43=\"\",\"\",'6.GASTOS VARIABLES'!L43))","v":""},{"$f":"IF($D115=\"\",\"\",IF('6.GASTOS VARIABLES'!M43=\"\",\"\",'6.GASTOS VARIABLES'!M43))","v":""},{"$f":"IF($D115=\"\",\"\",IF('6.GASTOS VARIABLES'!N43=\"\",\"\",'6.GASTOS VARIABLES'!N43))","v":""},{"$f":"IF($D115=\"\",\"\",IF('6.GASTOS VARIABLES'!O43=\"\",\"\",'6.GASTOS VARIABLES'!O43))","v":""},""]
[null,null,null,{"$f":"IF('6.GASTOS VARIABLES'!C44=\"TOTAL\",\"\",IF('6.GASTOS VARIABLES'!C44=\"\",\"\",'6.GASTOS VARIABLES'!C44))","v":""},{"$f":"IF($D116=\"\",\"\",IF('6.GASTOS VARIABLES'!D44=\"\",\"\",'6.GASTOS VARIABLES'!D44))","v":""},{"$f":"IF($D116=\"\",\"\",IF('6.GASTOS VARIABLES'!E44=\"\",\"\",'6.GASTOS VARIABLES'!E44))","v":""},{"$f":"IF($D116=\"\",\"\",IF('6.GASTOS VARIABLES'!F44=\"\",\"\",'6.GASTOS VARIABLES'!F44))","v":""},{"$f":"IF($D116=\"\",\"\",IF('6.GASTOS VARIABLES'!G44=\"\",\"\",'6.GASTOS VARIABLES'!G44))","v":""},{"$f":"IF($D116=\"\",\"\",IF('6.GASTOS VARIABLES'!H44=\"\",\"\",'6.GASTOS VARIABLES'!H44))","v":""},{"$f":"IF($D116=\"\",\"\",IF('6.GASTOS VARIABLES'!I44=\"\",\"\",'6.GASTOS VARIABLES'!I44))","v":""},{"$f":"IF($D116=\"\",\"\",IF('6.GASTOS VARIABLES'!J44=\"\",\"\",'6.GASTOS VARIABLES'!J44))","v":""},{"$f":"IF($D116=\"\",\"\",IF('6.GASTOS VARIABLES'!K44=\"\",\"\",'6.GASTOS VARIABLES'!K44))","v":""},{"$f":"IF($D116=\"\",\"\",IF('6.GASTOS VARIABLES'!L44=\"\",\"\",'6.GASTOS VARIABLES'!L44))","v":""},{"$f":"IF($D116=\"\",\"\",IF('6.GASTOS VARIABLES'!M44=\"\",\"\",'6.GASTOS VARIABLES'!M44))","v":""},{"$f":"IF($D116=\"\",\"\",IF('6.GASTOS VARIABLES'!N44=\"\",\"\",'6.GASTOS VARIABLES'!N44))","v":""},{"$f":"IF($D116=\"\",\"\",IF('6.GASTOS VARIABLES'!O44=\"\",\"\",'6.GASTOS VARIABLES'!O44))","v":""},""]
[null,null,null,{"$f":"IF('6.GASTOS VARIABLES'!C45=\"TOTAL\",\"\",IF('6.GASTOS VARIABLES'!C45=\"\",\"\",'6.GASTOS VARIABLES'!C45))","v":""},{"$f":"IF($D117=\"\",\"\",IF('6.GASTOS VARIABLES'!D45=\"\",\"\",'6.GASTOS VARIABLES'!D45))","v":""},{"$f":"IF($D117=\"\",\"\",IF('6.GASTOS VARIABLES'!E45=\"\",\"\",'6.GASTOS VARIABLES'!E45))","v":""},{"$f":"IF($D117=\"\",\"\",IF('6.GASTOS VARIABLES'!F45=\"\",\"\",'6.GASTOS VARIABLES'!F45))","v":""},{"$f":"IF($D117=\"\",\"\",IF('6.GASTOS VARIABLES'!G45=\"\",\"\",'6.GASTOS VARIABLES'!G45))","v":""},{"$f":"IF($D117=\"\",\"\",IF('6.GASTOS VARIABLES'!H45=\"\",\"\",'6.GASTOS VARIABLES'!H45))","v":""},{"$f":"IF($D117=\"\",\"\",IF('6.GASTOS VARIABLES'!I45=\"\",\"\",'6.GASTOS VARIABLES'!I45))","v":""},{"$f":"IF($D117=\"\",\"\",IF('6.GASTOS VARIABLES'!J45=\"\",\"\",'6.GASTOS VARIABLES'!J45))","v":""},{"$f":"IF($D117=\"\",\"\",IF('6.GASTOS VARIABLES'!K45=\"\",\"\",'6.GASTOS VARIABLES'!K45))","v":""},{"$f":"IF($D117=\"\",\"\",IF('6.GASTOS VARIABLES'!L45=\"\",\"\",'6.GASTOS VARIABLES'!L45))","v":""},{"$f":"IF($D117=\"\",\"\",IF('6.GASTOS VARIABLES'!M45=\"\",\"\",'6.GASTOS VARIABLES'!M45))","v":""},{"$f":"IF($D117=\"\",\"\",IF('6.GASTOS VARIABLES'!N45=\"\",\"\",'6.GASTOS VARIABLES'!N45))","v":""},{"$f":"IF($D117=\"\",\"\",IF('6.GASTOS VARIABLES'!O45=\"\",\"\",'6.GASTOS VARIABLES'!O45))","v":""},""]
[null,null,null,{"$f":"IF('6.GASTOS VARIABLES'!C46=\"TOTAL\",\"\",IF('6.GASTOS VARIABLES'!C46=\"\",\"\",'6.GASTOS VARIABLES'!C46))","v":""},{"$f":"IF($D118=\"\",\"\",IF('6.GASTOS VARIABLES'!D46=\"\",\"\",'6.GASTOS VARIABLES'!D46))","v":""},{"$f":"IF($D118=\"\",\"\",IF('6.GASTOS VARIABLES'!E46=\"\",\"\",'6.GASTOS VARIABLES'!E46))","v":""},{"$f":"IF($D118=\"\",\"\",IF('6.GASTOS VARIABLES'!F46=\"\",\"\",'6.GASTOS VARIABLES'!F46))","v":""},{"$f":"IF($D118=\"\",\"\",IF('6.GASTOS VARIABLES'!G46=\"\",\"\",'6.GASTOS VARIABLES'!G46))","v":""},{"$f":"IF($D118=\"\",\"\",IF('6.GASTOS VARIABLES'!H46=\"\",\"\",'6.GASTOS VARIABLES'!H46))","v":""},{"$f":"IF($D118=\"\",\"\",IF('6.GASTOS VARIABLES'!I46=\"\",\"\",'6.GASTOS VARIABLES'!I46))","v":""},{"$f":"IF($D118=\"\",\"\",IF('6.GASTOS VARIABLES'!J46=\"\",\"\",'6.GASTOS VARIABLES'!J46))","v":""},{"$f":"IF($D118=\"\",\"\",IF('6.GASTOS VARIABLES'!K46=\"\",\"\",'6.GASTOS VARIABLES'!K46))","v":""},{"$f":"IF($D118=\"\",\"\",IF('6.GASTOS VARIABLES'!L46=\"\",\"\",'6.GASTOS VARIABLES'!L46))","v":""},{"$f":"IF($D118=\"\",\"\",IF('6.GASTOS VARIABLES'!M46=\"\",\"\",'6.GASTOS VARIABLES'!M46))","v":""},{"$f":"IF($D118=\"\",\"\",IF('6.GASTOS VARIABLES'!N46=\"\",\"\",'6.GASTOS VARIABLES'!N46))","v":""},{"$f":"IF($D118=\"\",\"\",IF('6.GASTOS VARIABLES'!O46=\"\",\"\",'6.GASTOS VARIABLES'!O46))","v":""},""]
[null,null,null,{"$f":"IF('6.GASTOS VARIABLES'!C47=\"TOTAL\",\"\",IF('6.GASTOS VARIABLES'!C47=\"\",\"\",'6.GASTOS VARIABLES'!C47))","v":""},{"$f":"IF($D119=\"\",\"\",IF('6.GASTOS VARIABLES'!D47=\"\",\"\",'6.GASTOS VARIABLES'!D47))","v":""},{"$f":"IF($D119=\"\",\"\",IF('6.GASTOS VARIABLES'!E47=\"\",\"\",'6.GASTOS VARIABLES'!E47))","v":""},{"$f":"IF($D119=\"\",\"\",IF('6.GASTOS VARIABLES'!F47=\"\",\"\",'6.GASTOS VARIABLES'!F47))","v":""},{"$f":"IF($D119=\"\",\"\",IF('6.GASTOS VARIABLES'!G47=\"\",\"\",'6.GASTOS VARIABLES'!G47))","v":""},{"$f":"IF($D119=\"\",\"\",IF('6.GASTOS VARIABLES'!H47=\"\",\"\",'6.GASTOS VARIABLES'!H47))","v":""},{"$f":"IF($D119=\"\",\"\",IF('6.GASTOS VARIABLES'!I47=\"\",\"\",'6.GASTOS VARIABLES'!I47))","v":""},{"$f":"IF($D119=\"\",\"\",IF('6.GASTOS VARIABLES'!J47=\"\",\"\",'6.GASTOS VARIABLES'!J47))","v":""},{"$f":"IF($D119=\"\",\"\",IF('6.GASTOS VARIABLES'!K47=\"\",\"\",'6.GASTOS VARIABLES'!K47))","v":""},{"$f":"IF($D119=\"\",\"\",IF('6.GASTOS VARIABLES'!L47=\"\",\"\",'6.GASTOS VARIABLES'!L47))","v":""},{"$f":"IF($D119=\"\",\"\",IF('6.GASTOS VARIABLES'!M47=\"\",\"\",'6.GASTOS VARIABLES'!M47))","v":""},{"$f":"IF($D119=\"\",\"\",IF('6.GASTOS VARIABLES'!N47=\"\",\"\",'6.GASTOS VARIABLES'!N47))","v":""},{"$f":"IF($D119=\"\",\"\",IF('6.GASTOS VARIABLES'!O47=\"\",\"\",'6.GASTOS VARIABLES'!O47))","v":""},""]
[null,null,null,{"$f":"IF('6.GASTOS VARIABLES'!C48=\"TOTAL\",\"\",IF('6.GASTOS VARIABLES'!C48=\"\",\"\",'6.GASTOS VARIABLES'!C48))","v":""},{"$f":"IF($D120=\"\",\"\",IF('6.GASTOS VARIABLES'!D48=\"\",\"\",'6.GASTOS VARIABLES'!D48))","v":""},{"$f":"IF($D120=\"\",\"\",IF('6.GASTOS VARIABLES'!E48=\"\",\"\",'6.GASTOS VARIABLES'!E48))","v":""},{"$f":"IF($D120=\"\",\"\",IF('6.GASTOS VARIABLES'!F48=\"\",\"\",'6.GASTOS VARIABLES'!F48))","v":""},{"$f":"IF($D120=\"\",\"\",IF('6.GASTOS VARIABLES'!G48=\"\",\"\",'6.GASTOS VARIABLES'!G48))","v":""},{"$f":"IF($D120=\"\",\"\",IF('6.GASTOS VARIABLES'!H48=\"\",\"\",'6.GASTOS VARIABLES'!H48))","v":""},{"$f":"IF($D120=\"\",\"\",IF('6.GASTOS VARIABLES'!I48=\"\",\"\",'6.GASTOS VARIABLES'!I48))","v":""},{"$f":"IF($D120=\"\",\"\",IF('6.GASTOS VARIABLES'!J48=\"\",\"\",'6.GASTOS VARIABLES'!J48))","v":""},{"$f":"IF($D120=\"\",\"\",IF('6.GASTOS VARIABLES'!K48=\"\",\"\",'6.GASTOS VARIABLES'!K48))","v":""},{"$f":"IF($D120=\"\",\"\",IF('6.GASTOS VARIABLES'!L48=\"\",\"\",'6.GASTOS VARIABLES'!L48))","v":""},{"$f":"IF($D120=\"\",\"\",IF('6.GASTOS VARIABLES'!M48=\"\",\"\",'6.GASTOS VARIABLES'!M48))","v":""},{"$f":"IF($D120=\"\",\"\",IF('6.GASTOS VARIABLES'!N48=\"\",\"\",'6.GASTOS VARIABLES'!N48))","v":""},{"$f":"IF($D120=\"\",\"\",IF('6.GASTOS VARIABLES'!O48=\"\",\"\",'6.GASTOS VARIABLES'!O48))","v":""},""]
[null,null,null,{"$f":"IF('6.GASTOS VARIABLES'!C49=\"TOTAL\",\"\",IF('6.GASTOS VARIABLES'!C49=\"\",\"\",'6.GASTOS VARIABLES'!C49))","v":""},{"$f":"IF($D121=\"\",\"\",IF('6.GASTOS VARIABLES'!D49=\"\",\"\",'6.GASTOS VARIABLES'!D49))","v":""},{"$f":"IF($D121=\"\",\"\",IF('6.GASTOS VARIABLES'!E49=\"\",\"\",'6.GASTOS VARIABLES'!E49))","v":""},{"$f":"IF($D121=\"\",\"\",IF('6.GASTOS VARIABLES'!F49=\"\",\"\",'6.GASTOS VARIABLES'!F49))","v":""},{"$f":"IF($D121=\"\",\"\",IF('6.GASTOS VARIABLES'!G49=\"\",\"\",'6.GASTOS VARIABLES'!G49))","v":""},{"$f":"IF($D121=\"\",\"\",IF('6.GASTOS VARIABLES'!H49=\"\",\"\",'6.GASTOS VARIABLES'!H49))","v":""},{"$f":"IF($D121=\"\",\"\",IF('6.GASTOS VARIABLES'!I49=\"\",\"\",'6.GASTOS VARIABLES'!I49))","v":""},{"$f":"IF($D121=\"\",\"\",IF('6.GASTOS VARIABLES'!J49=\"\",\"\",'6.GASTOS VARIABLES'!J49))","v":""},{"$f":"IF($D121=\"\",\"\",IF('6.GASTOS VARIABLES'!K49=\"\",\"\",'6.GASTOS VARIABLES'!K49))","v":""},{"$f":"IF($D121=\"\",\"\",IF('6.GASTOS VARIABLES'!L49=\"\",\"\",'6.GASTOS VARIABLES'!L49))","v":""},{"$f":"IF($D121=\"\",\"\",IF('6.GASTOS VARIABLES'!M49=\"\",\"\",'6.GASTOS VARIABLES'!M49))","v":""},{"$f":"IF($D121=\"\",\"\",IF('6.GASTOS VARIABLES'!N49=\"\",\"\",'6.GASTOS VARIABLES'!N49))","v":""},{"$f":"IF($D121=\"\",\"\",IF('6.GASTOS VARIABLES'!O49=\"\",\"\",'6.GASTOS VARIABLES'!O49))","v":""},""]
[null,null,null,{"$f":"IF('6.GASTOS VARIABLES'!C50=\"TOTAL\",\"\",IF('6.GASTOS VARIABLES'!C50=\"\",\"\",'6.GASTOS VARIABLES'!C50))","v":""},{"$f":"IF($D122=\"\",\"\",IF('6.GASTOS VARIABLES'!D50=\"\",\"\",'6.GASTOS VARIABLES'!D50))","v":""},{"$f":"IF($D122=\"\",\"\",IF('6.GASTOS VARIABLES'!E50=\"\",\"\",'6.GASTOS VARIABLES'!E50))","v":""},{"$f":"IF($D122=\"\",\"\",IF('6.GASTOS VARIABLES'!F50=\"\",\"\",'6.GASTOS VARIABLES'!F50))","v":""},{"$f":"IF($D122=\"\",\"\",IF('6.GASTOS VARIABLES'!G50=\"\",\"\",'6.GASTOS VARIABLES'!G50))","v":""},{"$f":"IF($D122=\"\",\"\",IF('6.GASTOS VARIABLES'!H50=\"\",\"\",'6.GASTOS VARIABLES'!H50))","v":""},{"$f":"IF($D122=\"\",\"\",IF('6.GASTOS VARIABLES'!I50=\"\",\"\",'6.GASTOS VARIABLES'!I50))","v":""},{"$f":"IF($D122=\"\",\"\",IF('6.GASTOS VARIABLES'!J50=\"\",\"\",'6.GASTOS VARIABLES'!J50))","v":""},{"$f":"IF($D122=\"\",\"\",IF('6.GASTOS VARIABLES'!K50=\"\",\"\",'6.GASTOS VARIABLES'!K50))","v":""},{"$f":"IF($D122=\"\",\"\",IF('6.GASTOS VARIABLES'!L50=\"\",\"\",'6.GASTOS VARIABLES'!L50))","v":""},{"$f":"IF($D122=\"\",\"\",IF('6.GASTOS VARIABLES'!M50=\"\",\"\",'6.GASTOS VARIABLES'!M50))","v":""},{"$f":"IF($D122=\"\",\"\",IF('6.GASTOS VARIABLES'!N50=\"\",\"\",'6.GASTOS VARIABLES'!N50))","v":""},{"$f":"IF($D122=\"\",\"\",IF('6.GASTOS VARIABLES'!O50=\"\",\"\",'6.GASTOS VARIABLES'!O50))","v":""},""]
[null,null,null,{"$f":"IF('6.GASTOS VARIABLES'!C52=\"TOTAL\",\"\",IF('6.GASTOS VARIABLES'!C52=\"\",\"\",'6.GASTOS VARIABLES'!C52))","v":""},{"$f":"IF($D123=\"\",\"\",IF('6.GASTOS VARIABLES'!D52=\"\",\"\",'6.GASTOS VARIABLES'!D52))","v":""},{"$f":"IF($D123=\"\",\"\",IF('6.GASTOS VARIABLES'!E52=\"\",\"\",'6.GASTOS VARIABLES'!E52))","v":""},{"$f":"IF($D123=\"\",\"\",IF('6.GASTOS VARIABLES'!F52=\"\",\"\",'6.GASTOS VARIABLES'!F52))","v":""},{"$f":"IF($D123=\"\",\"\",IF('6.GASTOS VARIABLES'!G52=\"\",\"\",'6.GASTOS VARIABLES'!G52))","v":""},{"$f":"IF($D123=\"\",\"\",IF('6.GASTOS VARIABLES'!H52=\"\",\"\",'6.GASTOS VARIABLES'!H52))","v":""},{"$f":"IF($D123=\"\",\"\",IF('6.GASTOS VARIABLES'!I52=\"\",\"\",'6.GASTOS VARIABLES'!I52))","v":""},{"$f":"IF($D123=\"\",\"\",IF('6.GASTOS VARIABLES'!J52=\"\",\"\",'6.GASTOS VARIABLES'!J52))","v":""},{"$f":"IF($D123=\"\",\"\",IF('6.GASTOS VARIABLES'!K52=\"\",\"\",'6.GASTOS VARIABLES'!K52))","v":""},{"$f":"IF($D123=\"\",\"\",IF('6.GASTOS VARIABLES'!L52=\"\",\"\",'6.GASTOS VARIABLES'!L52))","v":""},{"$f":"IF($D123=\"\",\"\",IF('6.GASTOS VARIABLES'!M52=\"\",\"\",'6.GASTOS VARIABLES'!M52))","v":""},{"$f":"IF($D123=\"\",\"\",IF('6.GASTOS VARIABLES'!N52=\"\",\"\",'6.GASTOS VARIABLES'!N52))","v":""},{"$f":"IF($D123=\"\",\"\",IF('6.GASTOS VARIABLES'!O52=\"\",\"\",'6.GASTOS VARIABLES'!O52))","v":""},""]
[null,null,null,{"$f":"IF('6.GASTOS VARIABLES'!C53=\"TOTAL\",\"\",IF('6.GASTOS VARIABLES'!C53=\"\",\"\",'6.GASTOS VARIABLES'!C53))","v":""},{"$f":"IF($D124=\"\",\"\",IF('6.GASTOS VARIABLES'!D53=\"\",\"\",'6.GASTOS VARIABLES'!D53))","v":""},{"$f":"IF($D124=\"\",\"\",IF('6.GASTOS VARIABLES'!E53=\"\",\"\",'6.GASTOS VARIABLES'!E53))","v":""},{"$f":"IF($D124=\"\",\"\",IF('6.GASTOS VARIABLES'!F53=\"\",\"\",'6.GASTOS VARIABLES'!F53))","v":""},{"$f":"IF($D124=\"\",\"\",IF('6.GASTOS VARIABLES'!G53=\"\",\"\",'6.GASTOS VARIABLES'!G53))","v":""},{"$f":"IF($D124=\"\",\"\",IF('6.GASTOS VARIABLES'!H53=\"\",\"\",'6.GASTOS VARIABLES'!H53))","v":""},{"$f":"IF($D124=\"\",\"\",IF('6.GASTOS VARIABLES'!I53=\"\",\"\",'6.GASTOS VARIABLES'!I53))","v":""},{"$f":"IF($D124=\"\",\"\",IF('6.GASTOS VARIABLES'!J53=\"\",\"\",'6.GASTOS VARIABLES'!J53))","v":""},{"$f":"IF($D124=\"\",\"\",IF('6.GASTOS VARIABLES'!K53=\"\",\"\",'6.GASTOS VARIABLES'!K53))","v":""},{"$f":"IF($D124=\"\",\"\",IF('6.GASTOS VARIABLES'!L53=\"\",\"\",'6.GASTOS VARIABLES'!L53))","v":""},{"$f":"IF($D124=\"\",\"\",IF('6.GASTOS VARIABLES'!M53=\"\",\"\",'6.GASTOS VARIABLES'!M53))","v":""},{"$f":"IF($D124=\"\",\"\",IF('6.GASTOS VARIABLES'!N53=\"\",\"\",'6.GASTOS VARIABLES'!N53))","v":""},{"$f":"IF($D124=\"\",\"\",IF('6.GASTOS VARIABLES'!O53=\"\",\"\",'6.GASTOS VARIABLES'!O53))","v":""},""]
[null,null,null,{"$f":"IF('6.GASTOS VARIABLES'!C54=\"TOTAL\",\"\",IF('6.GASTOS VARIABLES'!C54=\"\",\"\",'6.GASTOS VARIABLES'!C54))","v":""},{"$f":"IF($D125=\"\",\"\",IF('6.GASTOS VARIABLES'!D54=\"\",\"\",'6.GASTOS VARIABLES'!D54))","v":""},{"$f":"IF($D125=\"\",\"\",IF('6.GASTOS VARIABLES'!E54=\"\",\"\",'6.GASTOS VARIABLES'!E54))","v":""},{"$f":"IF($D125=\"\",\"\",IF('6.GASTOS VARIABLES'!F54=\"\",\"\",'6.GASTOS VARIABLES'!F54))","v":""},{"$f":"IF($D125=\"\",\"\",IF('6.GASTOS VARIABLES'!G54=\"\",\"\",'6.GASTOS VARIABLES'!G54))","v":""},{"$f":"IF($D125=\"\",\"\",IF('6.GASTOS VARIABLES'!H54=\"\",\"\",'6.GASTOS VARIABLES'!H54))","v":""},{"$f":"IF($D125=\"\",\"\",IF('6.GASTOS VARIABLES'!I54=\"\",\"\",'6.GASTOS VARIABLES'!I54))","v":""},{"$f":"IF($D125=\"\",\"\",IF('6.GASTOS VARIABLES'!J54=\"\",\"\",'6.GASTOS VARIABLES'!J54))","v":""},{"$f":"IF($D125=\"\",\"\",IF('6.GASTOS VARIABLES'!K54=\"\",\"\",'6.GASTOS VARIABLES'!K54))","v":""},{"$f":"IF($D125=\"\",\"\",IF('6.GASTOS VARIABLES'!L54=\"\",\"\",'6.GASTOS VARIABLES'!L54))","v":""},{"$f":"IF($D125=\"\",\"\",IF('6.GASTOS VARIABLES'!M54=\"\",\"\",'6.GASTOS VARIABLES'!M54))","v":""},{"$f":"IF($D125=\"\",\"\",IF('6.GASTOS VARIABLES'!N54=\"\",\"\",'6.GASTOS VARIABLES'!N54))","v":""},{"$f":"IF($D125=\"\",\"\",IF('6.GASTOS VARIABLES'!O54=\"\",\"\",'6.GASTOS VARIABLES'!O54))","v":""},""]
[null,null,null,{"$f":"IF('6.GASTOS VARIABLES'!C55=\"TOTAL\",\"\",IF('6.GASTOS VARIABLES'!C55=\"\",\"\",'6.GASTOS VARIABLES'!C55))","v":""},{"$f":"IF($D126=\"\",\"\",IF('6.GASTOS VARIABLES'!D55=\"\",\"\",'6.GASTOS VARIABLES'!D55))","v":""},{"$f":"IF($D126=\"\",\"\",IF('6.GASTOS VARIABLES'!E55=\"\",\"\",'6.GASTOS VARIABLES'!E55))","v":""},{"$f":"IF($D126=\"\",\"\",IF('6.GASTOS VARIABLES'!F55=\"\",\"\",'6.GASTOS VARIABLES'!F55))","v":""},{"$f":"IF($D126=\"\",\"\",IF('6.GASTOS VARIABLES'!G55=\"\",\"\",'6.GASTOS VARIABLES'!G55))","v":""},{"$f":"IF($D126=\"\",\"\",IF('6.GASTOS VARIABLES'!H55=\"\",\"\",'6.GASTOS VARIABLES'!H55))","v":""},{"$f":"IF($D126=\"\",\"\",IF('6.GASTOS VARIABLES'!I55=\"\",\"\",'6.GASTOS VARIABLES'!I55))","v":""},{"$f":"IF($D126=\"\",\"\",IF('6.GASTOS VARIABLES'!J55=\"\",\"\",'6.GASTOS VARIABLES'!J55))","v":""},{"$f":"IF($D126=\"\",\"\",IF('6.GASTOS VARIABLES'!K55=\"\",\"\",'6.GASTOS VARIABLES'!K55))","v":""},{"$f":"IF($D126=\"\",\"\",IF('6.GASTOS VARIABLES'!L55=\"\",\"\",'6.GASTOS VARIABLES'!L55))","v":""},{"$f":"IF($D126=\"\",\"\",IF('6.GASTOS VARIABLES'!M55=\"\",\"\",'6.GASTOS VARIABLES'!M55))","v":""},{"$f":"IF($D126=\"\",\"\",IF('6.GASTOS VARIABLES'!N55=\"\",\"\",'6.GASTOS VARIABLES'!N55))","v":""},{"$f":"IF($D126=\"\",\"\",IF('6.GASTOS VARIABLES'!O55=\"\",\"\",'6.GASTOS VARIABLES'!O55))","v":""},""]
[null,null,null,{"$f":"IF('6.GASTOS VARIABLES'!C56=\"TOTAL\",\"\",IF('6.GASTOS VARIABLES'!C56=\"\",\"\",'6.GASTOS VARIABLES'!C56))","v":""},{"$f":"IF($D127=\"\",\"\",IF('6.GASTOS VARIABLES'!D56=\"\",\"\",'6.GASTOS VARIABLES'!D56))","v":""},{"$f":"IF($D127=\"\",\"\",IF('6.GASTOS VARIABLES'!E56=\"\",\"\",'6.GASTOS VARIABLES'!E56))","v":""},{"$f":"IF($D127=\"\",\"\",IF('6.GASTOS VARIABLES'!F56=\"\",\"\",'6.GASTOS VARIABLES'!F56))","v":""},{"$f":"IF($D127=\"\",\"\",IF('6.GASTOS VARIABLES'!G56=\"\",\"\",'6.GASTOS VARIABLES'!G56))","v":""},{"$f":"IF($D127=\"\",\"\",IF('6.GASTOS VARIABLES'!H56=\"\",\"\",'6.GASTOS VARIABLES'!H56))","v":""},{"$f":"IF($D127=\"\",\"\",IF('6.GASTOS VARIABLES'!I56=\"\",\"\",'6.GASTOS VARIABLES'!I56))","v":""},{"$f":"IF($D127=\"\",\"\",IF('6.GASTOS VARIABLES'!J56=\"\",\"\",'6.GASTOS VARIABLES'!J56))","v":""},{"$f":"IF($D127=\"\",\"\",IF('6.GASTOS VARIABLES'!K56=\"\",\"\",'6.GASTOS VARIABLES'!K56))","v":""},{"$f":"IF($D127=\"\",\"\",IF('6.GASTOS VARIABLES'!L56=\"\",\"\",'6.GASTOS VARIABLES'!L56))","v":""},{"$f":"IF($D127=\"\",\"\",IF('6.GASTOS VARIABLES'!M56=\"\",\"\",'6.GASTOS VARIABLES'!M56))","v":""},{"$f":"IF($D127=\"\",\"\",IF('6.GASTOS VARIABLES'!N56=\"\",\"\",'6.GASTOS VARIABLES'!N56))","v":""},{"$f":"IF($D127=\"\",\"\",IF('6.GASTOS VARIABLES'!O56=\"\",\"\",'6.GASTOS VARIABLES'!O56))","v":""},""]
[null,null,null,{"$f":"IF('6.GASTOS VARIABLES'!C57=\"TOTAL\",\"\",IF('6.GASTOS VARIABLES'!C57=\"\",\"\",'6.GASTOS VARIABLES'!C57))","v":""},{"$f":"IF($D128=\"\",\"\",IF('6.GASTOS VARIABLES'!D57=\"\",\"\",'6.GASTOS VARIABLES'!D57))","v":""},{"$f":"IF($D128=\"\",\"\",IF('6.GASTOS VARIABLES'!E57=\"\",\"\",'6.GASTOS VARIABLES'!E57))","v":""},{"$f":"IF($D128=\"\",\"\",IF('6.GASTOS VARIABLES'!F57=\"\",\"\",'6.GASTOS VARIABLES'!F57))","v":""},{"$f":"IF($D128=\"\",\"\",IF('6.GASTOS VARIABLES'!G57=\"\",\"\",'6.GASTOS VARIABLES'!G57))","v":""},{"$f":"IF($D128=\"\",\"\",IF('6.GASTOS VARIABLES'!H57=\"\",\"\",'6.GASTOS VARIABLES'!H57))","v":""},{"$f":"IF($D128=\"\",\"\",IF('6.GASTOS VARIABLES'!I57=\"\",\"\",'6.GASTOS VARIABLES'!I57))","v":""},{"$f":"IF($D128=\"\",\"\",IF('6.GASTOS VARIABLES'!J57=\"\",\"\",'6.GASTOS VARIABLES'!J57))","v":""},{"$f":"IF($D128=\"\",\"\",IF('6.GASTOS VARIABLES'!K57=\"\",\"\",'6.GASTOS VARIABLES'!K57))","v":""},{"$f":"IF($D128=\"\",\"\",IF('6.GASTOS VARIABLES'!L57=\"\",\"\",'6.GASTOS VARIABLES'!L57))","v":""},{"$f":"IF($D128=\"\",\"\",IF('6.GASTOS VARIABLES'!M57=\"\",\"\",'6.GASTOS VARIABLES'!M57))","v":""},{"$f":"IF($D128=\"\",\"\",IF('6.GASTOS VARIABLES'!N57=\"\",\"\",'6.GASTOS VARIABLES'!N57))","v":""},{"$f":"IF($D128=\"\",\"\",IF('6.GASTOS VARIABLES'!O57=\"\",\"\",'6.GASTOS VARIABLES'!O57))","v":""},""]
[]
[null,null,null,{"$f":"'6.GASTOS VARIABLES'!C52","v":"TOTAL"},{"$f":"+SUM(E97:E129)","v":0},{"$f":"+SUM(F97:F129)","v":0},0,0,0,0,0,0,0,0,0,0,0]
[]
[]
[]
[null,null,null,"TABLA B",{"$f":"E96","v":"1900enero"},{"$f":"F96","v":"1900enero"},"1900febrero","1900marzo","1900abril","1900mayo","1900junio","1900julio","1900agosto","1900septiembre","1900octubre","1900noviembre","TOTALES "]
[null,null,null,{"$f":"IF('ANEXO GASTOS VARIABLES'!B54=\"\",\"\",'ANEXO GASTOS VARIABLES'!B54)","v":""},{"$f":"IF(D135=\"\",\"\",'6.GASTOS VARIABLES'!D135)","v":""},{"$f":"IF(E135=\"\",\"\",'6.GASTOS VARIABLES'!E135)","v":""},{"$f":"IF(F135=\"\",\"\",'6.GASTOS VARIABLES'!F135)","v":""},{"$f":"IF(G135=\"\",\"\",'6.GASTOS VARIABLES'!G135)","v":""},{"$f":"IF(H135=\"\",\"\",'6.GASTOS VARIABLES'!H135)","v":""},{"$f":"IF(I135=\"\",\"\",'6.GASTOS VARIABLES'!I135)","v":""},{"$f":"IF(J135=\"\",\"\",'6.GASTOS VARIABLES'!J135)","v":""},{"$f":"IF(K135=\"\",\"\",'6.GASTOS VARIABLES'!K135)","v":""},{"$f":"IF(L135=\"\",\"\",'6.GASTOS VARIABLES'!L135)","v":""},{"$f":"IF(M135=\"\",\"\",'6.GASTOS VARIABLES'!M135)","v":""},{"$f":"IF(N135=\"\",\"\",'6.GASTOS VARIABLES'!N135)","v":""},{"$f":"IF(O135=\"\",\"\",'6.GASTOS VARIABLES'!O135)","v":""},{"$f":"IF(D135=\"\",\"\",SUM(E135:P135))","v":""}]
[null,null,null,{"$f":"IF('ANEXO GASTOS VARIABLES'!B55=\"\",\"\",'ANEXO GASTOS VARIABLES'!B55)","v":""},{"$f":"IF(D136=\"\",\"\",'6.GASTOS VARIABLES'!D136)","v":""},{"$f":"IF(E136=\"\",\"\",'6.GASTOS VARIABLES'!E136)","v":""},{"$f":"IF(F136=\"\",\"\",'6.GASTOS VARIABLES'!F136)","v":""},{"$f":"IF(G136=\"\",\"\",'6.GASTOS VARIABLES'!G136)","v":""},{"$f":"IF(H136=\"\",\"\",'6.GASTOS VARIABLES'!H136)","v":""},{"$f":"IF(I136=\"\",\"\",'6.GASTOS VARIABLES'!I136)","v":""},{"$f":"IF(J136=\"\",\"\",'6.GASTOS VARIABLES'!J136)","v":""},{"$f":"IF(K136=\"\",\"\",'6.GASTOS VARIABLES'!K136)","v":""},{"$f":"IF(L136=\"\",\"\",'6.GASTOS VARIABLES'!L136)","v":""},{"$f":"IF(M136=\"\",\"\",'6.GASTOS VARIABLES'!M136)","v":""},{"$f":"IF(N136=\"\",\"\",'6.GASTOS VARIABLES'!N136)","v":""},{"$f":"IF(O136=\"\",\"\",'6.GASTOS VARIABLES'!O136)","v":""},{"$f":"IF(D136=\"\",\"\",SUM(E136:P136))","v":""}]
[null,null,null,{"$f":"IF('ANEXO GASTOS VARIABLES'!B56=\"\",\"\",'ANEXO GASTOS VARIABLES'!B56)","v":""},{"$f":"IF(D137=\"\",\"\",'6.GASTOS VARIABLES'!D137)","v":""},{"$f":"IF(E137=\"\",\"\",'6.GASTOS VARIABLES'!E137)","v":""},{"$f":"IF(F137=\"\",\"\",'6.GASTOS VARIABLES'!F137)","v":""},{"$f":"IF(G137=\"\",\"\",'6.GASTOS VARIABLES'!G137)","v":""},{"$f":"IF(H137=\"\",\"\",'6.GASTOS VARIABLES'!H137)","v":""},{"$f":"IF(I137=\"\",\"\",'6.GASTOS VARIABLES'!I137)","v":""},{"$f":"IF(J137=\"\",\"\",'6.GASTOS VARIABLES'!J137)","v":""},{"$f":"IF(K137=\"\",\"\",'6.GASTOS VARIABLES'!K137)","v":""},{"$f":"IF(L137=\"\",\"\",'6.GASTOS VARIABLES'!L137)","v":""},{"$f":"IF(M137=\"\",\"\",'6.GASTOS VARIABLES'!M137)","v":""},{"$f":"IF(N137=\"\",\"\",'6.GASTOS VARIABLES'!N137)","v":""},{"$f":"IF(O137=\"\",\"\",'6.GASTOS VARIABLES'!O137)","v":""},""]
[null,null,null,{"$f":"IF('ANEXO GASTOS VARIABLES'!B57=\"\",\"\",'ANEXO GASTOS VARIABLES'!B57)","v":""},{"$f":"IF(D138=\"\",\"\",'6.GASTOS VARIABLES'!D138)","v":""},{"$f":"IF(E138=\"\",\"\",'6.GASTOS VARIABLES'!E138)","v":""},{"$f":"IF(F138=\"\",\"\",'6.GASTOS VARIABLES'!F138)","v":""},{"$f":"IF(G138=\"\",\"\",'6.GASTOS VARIABLES'!G138)","v":""},{"$f":"IF(H138=\"\",\"\",'6.GASTOS VARIABLES'!H138)","v":""},{"$f":"IF(I138=\"\",\"\",'6.GASTOS VARIABLES'!I138)","v":""},{"$f":"IF(J138=\"\",\"\",'6.GASTOS VARIABLES'!J138)","v":""},{"$f":"IF(K138=\"\",\"\",'6.GASTOS VARIABLES'!K138)","v":""},{"$f":"IF(L138=\"\",\"\",'6.GASTOS VARIABLES'!L138)","v":""},{"$f":"IF(M138=\"\",\"\",'6.GASTOS VARIABLES'!M138)","v":""},{"$f":"IF(N138=\"\",\"\",'6.GASTOS VARIABLES'!N138)","v":""},{"$f":"IF(O138=\"\",\"\",'6.GASTOS VARIABLES'!O138)","v":""},""]
[null,null,null,{"$f":"IF('ANEXO GASTOS VARIABLES'!B58=\"\",\"\",'ANEXO GASTOS VARIABLES'!B58)","v":""},{"$f":"IF(D139=\"\",\"\",'6.GASTOS VARIABLES'!D139)","v":""},{"$f":"IF(E139=\"\",\"\",'6.GASTOS VARIABLES'!E139)","v":""},{"$f":"IF(F139=\"\",\"\",'6.GASTOS VARIABLES'!F139)","v":""},{"$f":"IF(G139=\"\",\"\",'6.GASTOS VARIABLES'!G139)","v":""},{"$f":"IF(H139=\"\",\"\",'6.GASTOS VARIABLES'!H139)","v":""},{"$f":"IF(I139=\"\",\"\",'6.GASTOS VARIABLES'!I139)","v":""},{"$f":"IF(J139=\"\",\"\",'6.GASTOS VARIABLES'!J139)","v":""},{"$f":"IF(K139=\"\",\"\",'6.GASTOS VARIABLES'!K139)","v":""},{"$f":"IF(L139=\"\",\"\",'6.GASTOS VARIABLES'!L139)","v":""},{"$f":"IF(M139=\"\",\"\",'6.GASTOS VARIABLES'!M139)","v":""},{"$f":"IF(N139=\"\",\"\",'6.GASTOS VARIABLES'!N139)","v":""},{"$f":"IF(O139=\"\",\"\",'6.GASTOS VARIABLES'!O139)","v":""},""]
[null,null,null,{"$f":"IF('ANEXO GASTOS VARIABLES'!B59=\"\",\"\",'ANEXO GASTOS VARIABLES'!B59)","v":""},{"$f":"IF(D140=\"\",\"\",'6.GASTOS VARIABLES'!D140)","v":""},{"$f":"IF(E140=\"\",\"\",'6.GASTOS VARIABLES'!E140)","v":""},{"$f":"IF(F140=\"\",\"\",'6.GASTOS VARIABLES'!F140)","v":""},{"$f":"IF(G140=\"\",\"\",'6.GASTOS VARIABLES'!G140)","v":""},{"$f":"IF(H140=\"\",\"\",'6.GASTOS VARIABLES'!H140)","v":""},{"$f":"IF(I140=\"\",\"\",'6.GASTOS VARIABLES'!I140)","v":""},{"$f":"IF(J140=\"\",\"\",'6.GASTOS VARIABLES'!J140)","v":""},{"$f":"IF(K140=\"\",\"\",'6.GASTOS VARIABLES'!K140)","v":""},{"$f":"IF(L140=\"\",\"\",'6.GASTOS VARIABLES'!L140)","v":""},{"$f":"IF(M140=\"\",\"\",'6.GASTOS VARIABLES'!M140)","v":""},{"$f":"IF(N140=\"\",\"\",'6.GASTOS VARIABLES'!N140)","v":""},{"$f":"IF(O140=\"\",\"\",'6.GASTOS VARIABLES'!O140)","v":""},""]
[null,null,null,{"$f":"IF('ANEXO GASTOS VARIABLES'!B60=\"\",\"\",'ANEXO GASTOS VARIABLES'!B60)","v":""},{"$f":"IF(D141=\"\",\"\",'6.GASTOS VARIABLES'!D141)","v":""},{"$f":"IF(E141=\"\",\"\",'6.GASTOS VARIABLES'!E141)","v":""},{"$f":"IF(F141=\"\",\"\",'6.GASTOS VARIABLES'!F141)","v":""},{"$f":"IF(G141=\"\",\"\",'6.GASTOS VARIABLES'!G141)","v":""},{"$f":"IF(H141=\"\",\"\",'6.GASTOS VARIABLES'!H141)","v":""},{"$f":"IF(I141=\"\",\"\",'6.GASTOS VARIABLES'!I141)","v":""},{"$f":"IF(J141=\"\",\"\",'6.GASTOS VARIABLES'!J141)","v":""},{"$f":"IF(K141=\"\",\"\",'6.GASTOS VARIABLES'!K141)","v":""},{"$f":"IF(L141=\"\",\"\",'6.GASTOS VARIABLES'!L141)","v":""},{"$f":"IF(M141=\"\",\"\",'6.GASTOS VARIABLES'!M141)","v":""},{"$f":"IF(N141=\"\",\"\",'6.GASTOS VARIABLES'!N141)","v":""},{"$f":"IF(O141=\"\",\"\",'6.GASTOS VARIABLES'!O141)","v":""},""]
[null,null,null,{"$f":"IF('ANEXO GASTOS VARIABLES'!B61=\"\",\"\",'ANEXO GASTOS VARIABLES'!B61)","v":""},{"$f":"IF(D142=\"\",\"\",'6.GASTOS VARIABLES'!D142)","v":""},{"$f":"IF(E142=\"\",\"\",'6.GASTOS VARIABLES'!E142)","v":""},{"$f":"IF(F142=\"\",\"\",'6.GASTOS VARIABLES'!F142)","v":""},{"$f":"IF(G142=\"\",\"\",'6.GASTOS VARIABLES'!G142)","v":""},{"$f":"IF(H142=\"\",\"\",'6.GASTOS VARIABLES'!H142)","v":""},{"$f":"IF(I142=\"\",\"\",'6.GASTOS VARIABLES'!I142)","v":""},{"$f":"IF(J142=\"\",\"\",'6.GASTOS VARIABLES'!J142)","v":""},{"$f":"IF(K142=\"\",\"\",'6.GASTOS VARIABLES'!K142)","v":""},{"$f":"IF(L142=\"\",\"\",'6.GASTOS VARIABLES'!L142)","v":""},{"$f":"IF(M142=\"\",\"\",'6.GASTOS VARIABLES'!M142)","v":""},{"$f":"IF(N142=\"\",\"\",'6.GASTOS VARIABLES'!N142)","v":""},{"$f":"IF(O142=\"\",\"\",'6.GASTOS VARIABLES'!O142)","v":""},""]
[null,null,null,{"$f":"IF('ANEXO GASTOS VARIABLES'!B62=\"\",\"\",'ANEXO GASTOS VARIABLES'!B62)","v":""},{"$f":"IF(D143=\"\",\"\",'6.GASTOS VARIABLES'!D143)","v":""},{"$f":"IF(E143=\"\",\"\",'6.GASTOS VARIABLES'!E143)","v":""},{"$f":"IF(F143=\"\",\"\",'6.GASTOS VARIABLES'!F143)","v":""},{"$f":"IF(G143=\"\",\"\",'6.GASTOS VARIABLES'!G143)","v":""},{"$f":"IF(H143=\"\",\"\",'6.GASTOS VARIABLES'!H143)","v":""},{"$f":"IF(I143=\"\",\"\",'6.GASTOS VARIABLES'!I143)","v":""},{"$f":"IF(J143=\"\",\"\",'6.GASTOS VARIABLES'!J143)","v":""},{"$f":"IF(K143=\"\",\"\",'6.GASTOS VARIABLES'!K143)","v":""},{"$f":"IF(L143=\"\",\"\",'6.GASTOS VARIABLES'!L143)","v":""},{"$f":"IF(M143=\"\",\"\",'6.GASTOS VARIABLES'!M143)","v":""},{"$f":"IF(N143=\"\",\"\",'6.GASTOS VARIABLES'!N143)","v":""},{"$f":"IF(O143=\"\",\"\",'6.GASTOS VARIABLES'!O143)","v":""},""]
[null,null,null,{"$f":"IF('ANEXO GASTOS VARIABLES'!B63=\"\",\"\",'ANEXO GASTOS VARIABLES'!B63)","v":""},{"$f":"IF(D144=\"\",\"\",'6.GASTOS VARIABLES'!D144)","v":""},{"$f":"IF(E144=\"\",\"\",'6.GASTOS VARIABLES'!E144)","v":""},{"$f":"IF(F144=\"\",\"\",'6.GASTOS VARIABLES'!F144)","v":""},{"$f":"IF(G144=\"\",\"\",'6.GASTOS VARIABLES'!G144)","v":""},{"$f":"IF(H144=\"\",\"\",'6.GASTOS VARIABLES'!H144)","v":""},{"$f":"IF(I144=\"\",\"\",'6.GASTOS VARIABLES'!I144)","v":""},{"$f":"IF(J144=\"\",\"\",'6.GASTOS VARIABLES'!J144)","v":""},{"$f":"IF(K144=\"\",\"\",'6.GASTOS VARIABLES'!K144)","v":""},{"$f":"IF(L144=\"\",\"\",'6.GASTOS VARIABLES'!L144)","v":""},{"$f":"IF(M144=\"\",\"\",'6.GASTOS VARIABLES'!M144)","v":""},{"$f":"IF(N144=\"\",\"\",'6.GASTOS VARIABLES'!N144)","v":""},{"$f":"IF(O144=\"\",\"\",'6.GASTOS VARIABLES'!O144)","v":""},""]
[null,null,null,{"$f":"IF('ANEXO GASTOS VARIABLES'!B64=\"\",\"\",'ANEXO GASTOS VARIABLES'!B64)","v":""},{"$f":"IF(D145=\"\",\"\",'6.GASTOS VARIABLES'!D145)","v":""},{"$f":"IF(E145=\"\",\"\",'6.GASTOS VARIABLES'!E145)","v":""},{"$f":"IF(F145=\"\",\"\",'6.GASTOS VARIABLES'!F145)","v":""},{"$f":"IF(G145=\"\",\"\",'6.GASTOS VARIABLES'!G145)","v":""},{"$f":"IF(H145=\"\",\"\",'6.GASTOS VARIABLES'!H145)","v":""},{"$f":"IF(I145=\"\",\"\",'6.GASTOS VARIABLES'!I145)","v":""},{"$f":"IF(J145=\"\",\"\",'6.GASTOS VARIABLES'!J145)","v":""},{"$f":"IF(K145=\"\",\"\",'6.GASTOS VARIABLES'!K145)","v":""},{"$f":"IF(L145=\"\",\"\",'6.GASTOS VARIABLES'!L145)","v":""},{"$f":"IF(M145=\"\",\"\",'6.GASTOS VARIABLES'!M145)","v":""},{"$f":"IF(N145=\"\",\"\",'6.GASTOS VARIABLES'!N145)","v":""},{"$f":"IF(O145=\"\",\"\",'6.GASTOS VARIABLES'!O145)","v":""},""]
[null,null,null,"TOTAL",{"$f":"+SUM(E135:E145)","v":0},{"$f":"+SUM(F135:F145)","v":0},0,0,0,0,0,0,0,0,0,0,0]
[]
[]
[]
[]
[]
[null,"Préstamos "]
[]
[null,null,null,"Cuota de préstamo",{"$f":"+E96","v":"1900enero"},"1900enero","1900febrero","1900marzo","1900abril","1900mayo","1900junio","1900julio","1900agosto","1900septiembre","1900octubre","1900noviembre","TOTALES "]
[null,null,null,null,{"$f":"IF('ANEXO FINANCIACIÓN'!$G24=\"\",\"\",'ANEXO FINANCIACIÓN'!$G24)","v":""},{"$f":"IF('ANEXO FINANCIACIÓN'!$G25=\"\",\"\",'ANEXO FINANCIACIÓN'!$G25)","v":""},{"$f":"IF('ANEXO FINANCIACIÓN'!$G26=\"\",\"\",'ANEXO FINANCIACIÓN'!$G24)","v":""},{"$f":"IF('ANEXO FINANCIACIÓN'!$G27=\"\",\"\",'ANEXO FINANCIACIÓN'!$G24)","v":""},{"$f":"IF('ANEXO FINANCIACIÓN'!$G28=\"\",\"\",'ANEXO FINANCIACIÓN'!$G24)","v":""},{"$f":"IF('ANEXO FINANCIACIÓN'!$G29=\"\",\"\",'ANEXO FINANCIACIÓN'!$G24)","v":""},{"$f":"IF('ANEXO FINANCIACIÓN'!$G30=\"\",\"\",'ANEXO FINANCIACIÓN'!$G24)","v":""},{"$f":"IF('ANEXO FINANCIACIÓN'!$G31=\"\",\"\",'ANEXO FINANCIACIÓN'!$G24)","v":""},{"$f":"IF('ANEXO FINANCIACIÓN'!$G32=\"\",\"\",'ANEXO FINANCIACIÓN'!$G32)","v":""},{"$f":"IF('ANEXO FINANCIACIÓN'!$G33=\"\",\"\",'ANEXO FINANCIACIÓN'!$G33)","v":""},{"$f":"IF('ANEXO FINANCIACIÓN'!$G34=\"\",\"\",'ANEXO FINANCIACIÓN'!$G34)","v":""},{"$f":"IF('ANEXO FINANCIACIÓN'!$G35=\"\",\"\",'ANEXO FINANCIACIÓN'!$G35)","v":""},{"$f":"SUM(Q107:Q126)","v":0}]
[]
[]
[null,"Liquidacion de impuestos "]
[]
[]
[null,null,null,{"$f":"+'8.IMPUESTOS '!B42","v":"PAGOS IVA"},{"$f":"+'8.IMPUESTOS '!C42","v":"1900enero"},{"$f":"+'8.IMPUESTOS '!D42","v":"1900enero"},{"$f":"+'8.IMPUESTOS '!E42","v":"1900febrero"},{"$f":"+'8.IMPUESTOS '!F42","v":"1900marzo"},{"$f":"+'8.IMPUESTOS '!G42","v":"1900abril"},{"$f":"+'8.IMPUESTOS '!H42","v":"1900mayo"},{"$f":"+'8.IMPUESTOS '!I42","v":"1900junio"},{"$f":"+'8.IMPUESTOS '!J42","v":"1900julio"},{"$f":"+'8.IMPUESTOS '!K42","v":"1900agosto"},{"$f":"+'8.IMPUESTOS '!L42","v":"1900septiembre"},{"$f":"+'8.IMPUESTOS '!M42","v":"1900octubre"},{"$f":"+'8.IMPUESTOS '!N42","v":"1900noviembre"},{"$f":"+'8.IMPUESTOS '!O42","v":"TOTAL"}]
[null,null,null,{"$f":"+'8.IMPUESTOS '!B43","v":"LIQUIDACIÓN IVA "},{"$f":"+'8.IMPUESTOS '!C43","v":"LIQUIDACIÓN IVA "},{"$f":"+'8.IMPUESTOS '!D43","v":0},{"$f":"+'8.IMPUESTOS '!E43","v":0},{"$f":"+'8.IMPUESTOS '!F43","v":0},{"$f":"+'8.IMPUESTOS '!G43","v":0},{"$f":"+'8.IMPUESTOS '!H43","v":0},{"$f":"+'8.IMPUESTOS '!I43","v":0},{"$f":"+'8.IMPUESTOS '!J43","v":0},{"$f":"+'8.IMPUESTOS '!K43","v":0},{"$f":"+'8.IMPUESTOS '!L43","v":0},{"$f":"+'8.IMPUESTOS '!M43","v":0},{"$f":"+'8.IMPUESTOS '!N43","v":0},{"$f":"+'8.IMPUESTOS '!O43","v":0}]
[]
[null,null,null,{"$f":"+'8.IMPUESTOS '!B45","v":"PAGOS RETENCIONES IRPF"},{"$f":"+'8.IMPUESTOS '!C45","v":"1900enero"},{"$f":"+'8.IMPUESTOS '!D45","v":"1900enero"},{"$f":"+'8.IMPUESTOS '!E45","v":"1900febrero"},{"$f":"+'8.IMPUESTOS '!F45","v":"1900marzo"},{"$f":"+'8.IMPUESTOS '!G45","v":"1900abril"},{"$f":"+'8.IMPUESTOS '!H45","v":"1900mayo"},{"$f":"+'8.IMPUESTOS '!I45","v":"1900junio"},{"$f":"+'8.IMPUESTOS '!J45","v":"1900julio"},{"$f":"+'8.IMPUESTOS '!K45","v":"1900agosto"},{"$f":"+'8.IMPUESTOS '!L45","v":"1900septiembre"},{"$f":"+'8.IMPUESTOS '!M45","v":"1900octubre"},{"$f":"+'8.IMPUESTOS '!N45","v":"1900noviembre"},{"$f":"+'8.IMPUESTOS '!O45","v":"TOTAL"}]
[null,null,null,{"$f":"+'8.IMPUESTOS '!B46","v":"LIQUIDACION RETENCIONES IRPF"},{"$f":"+'8.IMPUESTOS '!C46","v":"RETENCIONES IRPF"},{"$f":"+'8.IMPUESTOS '!D46","v":0},{"$f":"+'8.IMPUESTOS '!E46","v":0},{"$f":"+'8.IMPUESTOS '!F46","v":0},{"$f":"+'8.IMPUESTOS '!G46","v":0},{"$f":"+'8.IMPUESTOS '!H46","v":0},{"$f":"+'8.IMPUESTOS '!I46","v":0},{"$f":"+'8.IMPUESTOS '!J46","v":0},{"$f":"+'8.IMPUESTOS '!K46","v":0},{"$f":"+'8.IMPUESTOS '!L46","v":0},{"$f":"+'8.IMPUESTOS '!M46","v":0},{"$f":"+'8.IMPUESTOS '!N46","v":0},{"$f":"+'8.IMPUESTOS '!O46","v":0}]
[]
[null,null,null,{"$f":"+'8.IMPUESTOS '!B48","v":"PAGO IMPUESTO BENEFICIOS (IRPF o IS)"},{"$f":"+'8.IMPUESTOS '!C48","v":"1900enero"},{"$f":"+'8.IMPUESTOS '!D48","v":"1900enero"},{"$f":"+'8.IMPUESTOS '!E48","v":"1900febrero"},{"$f":"+'8.IMPUESTOS '!F48","v":"1900marzo"},{"$f":"+'8.IMPUESTOS '!G48","v":"1900abril"},{"$f":"+'8.IMPUESTOS '!H48","v":"1900mayo"},{"$f":"+'8.IMPUESTOS '!I48","v":"1900junio"},{"$f":"+'8.IMPUESTOS '!J48","v":"1900julio"},{"$f":"+'8.IMPUESTOS '!K48","v":"1900agosto"},{"$f":"+'8.IMPUESTOS '!L48","v":"1900septiembre"},{"$f":"+'8.IMPUESTOS '!M48","v":"1900octubre"},{"$f":"+'8.IMPUESTOS '!N48","v":"1900noviembre"},{"$f":"+'8.IMPUESTOS '!O48","v":"TOTAL"}]
[null,null,null,{"$f":"+'8.IMPUESTOS '!B49","v":"LIQUIDACION IMPUESTO BENEFICIOS (IRPF o IS)"},{"$f":"+'8.IMPUESTOS '!C49","v":"RETENCIONES IRPF "},{"$f":"+'8.IMPUESTOS '!D49","v":{"$error":"#VALUE!"}},{"$f":"+'8.IMPUESTOS '!E49","v":0},{"$f":"+'8.IMPUESTOS '!F49","v":0},{"$f":"+'8.IMPUESTOS '!G49","v":{"$error":"#VALUE!"}},{"$f":"+'8.IMPUESTOS '!H49","v":0},{"$f":"+'8.IMPUESTOS '!I49","v":0},{"$f":"+'8.IMPUESTOS '!J49","v":{"$error":"#VALUE!"}},{"$f":"+'8.IMPUESTOS '!K49","v":0},{"$f":"+'8.IMPUESTOS '!L49","v":0},{"$f":"+'8.IMPUESTOS '!M49","v":{"$error":"#VALUE!"}},{"$f":"+'8.IMPUESTOS '!N49","v":0},{"$f":"+'8.IMPUESTOS '!O49","v":{"$error":"#VALUE!"}}]

{"sheet":"3.INVERSION_FINANCIACION","index":10,"n_rows":168,"n_cols":11,"rows_kept":168,"cut":false,"hidden":false,"merged":[[151,1,151,5],[130,6,130,10],[11,2,11,6],[69,6,69,7],[15,1,15,7],[17,6,17,7],[64,1,65,3],[130,1,130,5],[81,1,81,3]]}
[]
[null,"Volver al Indice "]
[null,"Consultar anexo inversión inicial "]
[null,"Consultar anexo financiación "]
[]
[]
[]
[]
[]
[]
[]
[null,null,"INVERSION INICIAL / FINANCIACIÓN"]
[]
[]
[]
[null,"CUADRO inversion inicial. / FINANCIACION"]
[]
[null,null,"GASTO ","GASTO CON IVA ",null,null,{"$f":"IF(H20<D58,\"FALTA DE FINANCIACIÓN\",IF(H20>D58,\"EXCESO DE FINANCIACIÓN\",\"FINANCIACIÓN EXACTA\"))","v":"FINANCIACIÓN EXACTA"}]
[null,"GASTOS DE ESTABLECIMIENTO",{"$f":"'ANEXO INVERSIÓN'!E10","v":0},{"$f":"'ANEXO INVERSIÓN'!F10","v":0}]
[null,{"$f":"IF('ANEXO INVERSIÓN'!D11=\"\",\"\",'ANEXO INVERSIÓN'!D11)","v":"Licencia Actividad"},{"$f":"'ANEXO INVERSIÓN'!E11","v":0},{"$f":"'ANEXO INVERSIÓN'!F11","v":""},null,null,"TOTAL FINANCIACIÓN",{"$f":"SUM(H27,H31,H22)","v":0}]
[null,{"$f":"IF('ANEXO INVERSIÓN'!D12=\"\",\"\",'ANEXO INVERSIÓN'!D12)","v":"Permisos"},{"$f":"'ANEXO INVERSIÓN'!E12","v":0},{"$f":"'ANEXO INVERSIÓN'!F12","v":""}]
[null,{"$f":"IF('ANEXO INVERSIÓN'!D13=\"\",\"\",'ANEXO INVERSIÓN'!D13)","v":"Gastos Constitución"},{"$f":"'ANEXO INVERSIÓN'!E13","v":0},{"$f":"'ANEXO INVERSIÓN'!F13","v":""},null,null,"FONDOS PROPIOS ",{"$f":"SUM(H23:H25)","v":0}]
[null,{"$f":"IF('ANEXO INVERSIÓN'!D14=\"\",\"\",'ANEXO INVERSIÓN'!D14)","v":"Obras y reformas"},{"$f":"'ANEXO INVERSIÓN'!E14","v":0},{"$f":"'ANEXO INVERSIÓN'!F14","v":""},null,null,{"$f":"+IF('ANEXO FINANCIACIÓN'!B12<>\"\",'ANEXO FINANCIACIÓN'!B12,\"\")","v":"Capital Social"},{"$f":"+IF('ANEXO FINANCIACIÓN'!C12<>\"\",'ANEXO FINANCIACIÓN'!C12,\"\")","v":""}]
[null,{"$f":"IF('ANEXO INVERSIÓN'!D15=\"\",\"\",'ANEXO INVERSIÓN'!D15)","v":"Fianza o Aval Alquiler Local"},{"$f":"'ANEXO INVERSIÓN'!E15","v":0},{"$f":"'ANEXO INVERSIÓN'!F15","v":""},null,null,{"$f":"+IF('ANEXO FINANCIACIÓN'!B13<>\"\",'ANEXO FINANCIACIÓN'!B13,\"\")","v":"Subvenciones"},{"$f":"+IF('ANEXO FINANCIACIÓN'!C13<>\"\",'ANEXO FINANCIACIÓN'!C13,\"\")","v":""}]
[null,{"$f":"IF('ANEXO INVERSIÓN'!D16=\"\",\"\",'ANEXO INVERSIÓN'!D16)","v":"Asesoramiento inicial"},{"$f":"'ANEXO INVERSIÓN'!E16","v":0},{"$f":"'ANEXO INVERSIÓN'!F16","v":""},null,null,{"$f":"+IF('ANEXO FINANCIACIÓN'!B14<>\"\",'ANEXO FINANCIACIÓN'!B14,\"\")","v":"Otros fondos propios "},{"$f":"+IF('ANEXO FINANCIACIÓN'!C14<>\"\",'ANEXO FINANCIACIÓN'!C14,\"\")","v":""}]
[null,{"$f":"IF('ANEXO INVERSIÓN'!D17=\"\",\"\",'ANEXO INVERSIÓN'!D17)","v":""},{"$f":"IF(B26=\"\",\"\",'ANEXO INVERSIÓN'!E17)","v":""},{"$f":"IF(B26=\"\",\"\",'ANEXO INVERSIÓN'!F17)","v":""}]
[null,{"$f":"IF('ANEXO INVERSIÓN'!D18=\"\",\"\",'ANEXO INVERSIÓN'!D18)","v":""},{"$f":"IF(B27=\"\",\"\",'ANEXO INVERSIÓN'!E18)","v":""},{"$f":"IF(B27=\"\",\"\",'ANEXO INVERSIÓN'!F18)","v":""},null,null,"FINANCIACION AJENA A L/P",{"$f":"SUM(H28:H29)","v":0}]
[null,{"$f":"IF('ANEXO INVERSIÓN'!D19=\"\",\"\",'ANEXO INVERSIÓN'!D19)","v":""},{"$f":"IF(B28=\"\",\"\",'ANEXO INVERSIÓN'!E19)","v":""},{"$f":"IF(B28=\"\",\"\",'ANEXO INVERSIÓN'!F19)","v":""},null,null,{"$f":"+IF('ANEXO FINANCIACIÓN'!B17<>\"\",'ANEXO FINANCIACIÓN'!B17,\"\")","v":"Deudas con entidades de crédito a largo plazo"},{"$f":"+IF('ANEXO FINANCIACIÓN'!C17<>\"\",'ANEXO FINANCIACIÓN'!C17,\"\")","v":0}]
[null,{"$f":"IF('ANEXO INVERSIÓN'!D20=\"\",\"\",'ANEXO INVERSIÓN'!D20)","v":""},{"$f":"IF(B29=\"\",\"\",'ANEXO INVERSIÓN'!E20)","v":""},{"$f":"IF(B29=\"\",\"\",'ANEXO INVERSIÓN'!F20)","v":""},null,null,{"$f":"+IF('ANEXO FINANCIACIÓN'!B18<>\"\",'ANEXO FINANCIACIÓN'!B18,\"\")","v":"Otras deudas a largo plazo"},{"$f":"+IF('ANEXO FINANCIACIÓN'!C18<>\"\",'ANEXO FINANCIACIÓN'!C18,\"\")","v":""}]
[null,{"$f":"'ANEXO INVERSIÓN'!D21","v":"ACTIVO NO CORRIENTE"},{"$f":"'ANEXO INVERSIÓN'!E21","v":0},{"$f":"'ANEXO INVERSIÓN'!F21","v":0}]
[null,{"$f":"IF('ANEXO INVERSIÓN'!D22=\"\",\"\",'ANEXO INVERSIÓN'!D22)","v":"Terrenos y bienes naturales"},{"$f":"'ANEXO INVERSIÓN'!E22","v":0},{"$f":"'ANEXO INVERSIÓN'!F22","v":""},null,null,"FINANCIACIÓN AJENA A C/P",{"$f":"SUM(H32:H35)","v":0}]
[null,{"$f":"IF('ANEXO INVERSIÓN'!D23=\"\",\"\",'ANEXO INVERSIÓN'!D23)","v":"Construcciones"},{"$f":"'ANEXO INVERSIÓN'!E23","v":0},{"$f":"'ANEXO INVERSIÓN'!F23","v":""},null,null,{"$f":"+IF('ANEXO FINANCIACIÓN'!B21<>\"\",'ANEXO FINANCIACIÓN'!B21,\"\")","v":"Proveedores"},{"$f":"+IF('ANEXO FINANCIACIÓN'!C21<>\"\",'ANEXO FINANCIACIÓN'!C21,\"\")","v":""}]
[null,{"$f":"IF('ANEXO INVERSIÓN'!D24=\"\",\"\",'ANEXO INVERSIÓN'!D24)","v":"Maquinaria"},{"$f":"'ANEXO INVERSIÓN'!E24","v":0},{"$f":"'ANEXO INVERSIÓN'!F24","v":""},null,null,{"$f":"+IF('ANEXO FINANCIACIÓN'!B22<>\"\",'ANEXO FINANCIACIÓN'!B22,\"\")","v":"Deudas con entidades de crédito a corto plazo"},{"$f":"+IF('ANEXO FINANCIACIÓN'!C22<>\"\",'ANEXO FINANCIACIÓN'!C22,\"\")","v":""}]
[null,{"$f":"IF('ANEXO INVERSIÓN'!D25=\"\",\"\",'ANEXO INVERSIÓN'!D25)","v":"Utillaje y herramienta"},{"$f":"'ANEXO INVERSIÓN'!E25","v":0},{"$f":"'ANEXO INVERSIÓN'!F25","v":""},null,null,{"$f":"+IF('ANEXO FINANCIACIÓN'!B23<>\"\",'ANEXO FINANCIACIÓN'!B23,\"\")","v":"Deudas con las Administraciones Públicas"},{"$f":"+IF('ANEXO FINANCIACIÓN'!C23<>\"\",'ANEXO FINANCIACIÓN'!C23,\"\")","v":""}]
[null,{"$f":"IF('ANEXO INVERSIÓN'!D26=\"\",\"\",'ANEXO INVERSIÓN'!D26)","v":"Instalación de riego "},{"$f":"'ANEXO INVERSIÓN'!E26","v":0},{"$f":"'ANEXO INVERSIÓN'!F26","v":0},null,null,{"$f":"+IF('ANEXO FINANCIACIÓN'!B24<>\"\",'ANEXO FINANCIACIÓN'!B24,\"\")","v":"Otras deudas a corto plazo"},{"$f":"+IF('ANEXO FINANCIACIÓN'!C24<>\"\",'ANEXO FINANCIACIÓN'!C24,\"\")","v":""}]
[null,{"$f":"IF('ANEXO INVERSIÓN'!D28=\"\",\"\",'ANEXO INVERSIÓN'!D28)","v":"Mobiliario"},{"$f":"'ANEXO INVERSIÓN'!E28","v":0},{"$f":"'ANEXO INVERSIÓN'!F28","v":""}]
[null,{"$f":"IF('ANEXO INVERSIÓN'!D29=\"\",\"\",'ANEXO INVERSIÓN'!D29)","v":"Equipos para proceso de información"},{"$f":"'ANEXO INVERSIÓN'!E29","v":0},{"$f":"'ANEXO INVERSIÓN'!F29","v":""}]
[null,{"$f":"IF('ANEXO INVERSIÓN'!D30=\"\",\"\",'ANEXO INVERSIÓN'!D30)","v":"Elementos de transporte"},{"$f":"'ANEXO INVERSIÓN'!E30","v":0},{"$f":"'ANEXO INVERSIÓN'!F30","v":""}]
[null,{"$f":"IF('ANEXO INVERSIÓN'!D31=\"\",\"\",'ANEXO INVERSIÓN'!D31)","v":"Gastos de inv.y des., pro. intelectual y derechos de traspaso"},{"$f":"'ANEXO INVERSIÓN'!E31","v":0},{"$f":"'ANEXO INVERSIÓN'!F31","v":""}]
[null,{"$f":"IF('ANEXO INVERSIÓN'!D32=\"\",\"\",'ANEXO INVERSIÓN'!D32)","v":"Aplicaciones informáticas"},{"$f":"'ANEXO INVERSIÓN'!E32","v":0},{"$f":"'ANEXO INVERSIÓN'!F32","v":""}]
[null,{"$f":"IF('ANEXO INVERSIÓN'!D33=\"\",\"\",'ANEXO INVERSIÓN'!D33)","v":"Imagen corporativa"},{"$f":"'ANEXO INVERSIÓN'!E33","v":0},{"$f":"'ANEXO INVERSIÓN'!F33","v":""}]
[null,{"$f":"IF('ANEXO INVERSIÓN'!D34=\"\",\"\",'ANEXO INVERSIÓN'!D34)","v":""},{"$f":"IF(B42=\"\",\"\",'ANEXO INVERSIÓN'!E34)","v":""},{"$f":"IF(B42=\"\",\"\",'ANEXO INVERSIÓN'!F34)","v":""}]
[null,{"$f":"IF('ANEXO INVERSIÓN'!D35=\"\",\"\",'ANEXO INVERSIÓN'!D35)","v":""},{"$f":"IF(B43=\"\",\"\",'ANEXO INVERSIÓN'!E35)","v":""},{"$f":"IF(B43=\"\",\"\",'ANEXO INVERSIÓN'!F35)","v":""}]
[null,{"$f":"IF('ANEXO INVERSIÓN'!D36=\"\",\"\",'ANEXO INVERSIÓN'!D36)","v":""},{"$f":"IF(B44=\"\",\"\",'ANEXO INVERSIÓN'!E36)","v":""},{"$f":"IF(B44=\"\",\"\",'ANEXO INVERSIÓN'!F36)","v":""}]
[null,{"$f":"IF('ANEXO INVERSIÓN'!D37=\"\",\"\",'ANEXO INVERSIÓN'!D37)","v":""},{"$f":"IF(B45=\"\",\"\",'ANEXO INVERSIÓN'!E37)","v":""},{"$f":"IF(B45=\"\",\"\",'ANEXO INVERSIÓN'!F37)","v":""}]
[null,{"$f":"IF('ANEXO INVERSIÓN'!D38=\"\",\"\",'ANEXO INVERSIÓN'!D38)","v":""},{"$f":"IF(B46=\"\",\"\",'ANEXO INVERSIÓN'!E38)","v":""},{"$f":"IF(B46=\"\",\"\",'ANEXO INVERSIÓN'!F38)","v":""}]
[null,{"$f":"'ANEXO INVERSIÓN'!D39","v":"ACTIVO CORRIENTE"},{"$f":"'ANEXO INVERSIÓN'!E39","v":0},{"$f":"'ANEXO INVERSIÓN'!F39","v":0}]
[null,{"$f":"IF('ANEXO INVERSIÓN'!D40=\"\",\"\",'ANEXO INVERSIÓN'!D40)","v":"Stock Inicial de material para la venta"},{"$f":"'ANEXO INVERSIÓN'!E40","v":0},{"$f":"'ANEXO INVERSIÓN'!F40","v":""}]
[null,{"$f":"IF('ANEXO INVERSIÓN'!B42=\"\",\"\",'ANEXO INVERSIÓN'!B42)","v":""},{"$f":"IF(B49=\"\",\"\",'ANEXO INVERSIÓN'!E42)","v":""},{"$f":"IF(B49=\"\",\"\",'ANEXO INVERSIÓN'!F42)","v":""}]
[null,{"$f":"IF('ANEXO INVERSIÓN'!B43=\"\",\"\",'ANEXO INVERSIÓN'!B43)","v":""},{"$f":"IF(B50=\"\",\"\",'ANEXO INVERSIÓN'!E43)","v":""},{"$f":"IF(B50=\"\",\"\",'ANEXO INVERSIÓN'!F43)","v":""}]
[null,{"$f":"IF('ANEXO INVERSIÓN'!B44=\"\",\"\",'ANEXO INVERSIÓN'!B44)","v":""},{"$f":"IF(B51=\"\",\"\",'ANEXO INVERSIÓN'!E44)","v":""},{"$f":"IF(B51=\"\",\"\",'ANEXO INVERSIÓN'!F44)","v":""}]
[null,{"$f":"IF('ANEXO INVERSIÓN'!B45=\"\",\"\",'ANEXO INVERSIÓN'!B45)","v":""},{"$f":"IF(B52=\"\",\"\",'ANEXO INVERSIÓN'!E45)","v":""},{"$f":"IF(B52=\"\",\"\",'ANEXO INVERSIÓN'!F45)","v":""}]
[null,{"$f":"IF('ANEXO INVERSIÓN'!D41=\"\",\"\",'ANEXO INVERSIÓN'!D41)","v":"Tesorería"},{"$f":"'ANEXO INVERSIÓN'!E41","v":0},{"$f":"'ANEXO INVERSIÓN'!F41","v":""}]
[null,{"$f":"IF('ANEXO INVERSIÓN'!D42=\"\",\"\",'ANEXO INVERSIÓN'!D42)","v":""},{"$f":"IF(B54=\"\",\"\",'ANEXO INVERSIÓN'!E42)","v":""},{"$f":"IF(B54=\"\",\"\",'ANEXO INVERSIÓN'!F42)","v":""}]
[null,{"$f":"IF('ANEXO INVERSIÓN'!D43=\"\",\"\",'ANEXO INVERSIÓN'!D43)","v":""},{"$f":"IF(B55=\"\",\"\",'ANEXO INVERSIÓN'!E43)","v":""},{"$f":"IF(B55=\"\",\"\",'ANEXO INVERSIÓN'!F43)","v":""}]
[null,{"$f":"IF('ANEXO INVERSIÓN'!D44=\"\",\"\",'ANEXO INVERSIÓN'!D44)","v":""},{"$f":"IF(B56=\"\",\"\",'ANEXO INVERSIÓN'!E44)","v":""},{"$f":"IF(B56=\"\",\"\",'ANEXO INVERSIÓN'!F44)","v":""}]
[null,{"$f":"IF('ANEXO INVERSIÓN'!D45=\"\",\"\",'ANEXO INVERSIÓN'!D45)","v":""},{"$f":"IF(B57=\"\",\"\",'ANEXO INVERSIÓN'!E45)","v":""},{"$f":"IF(B57=\"\",\"\",'ANEXO INVERSIÓN'!F45)","v":""}]
[null,{"$f":"'ANEXO INVERSIÓN'!D46","v":"TOTALES "},{"$f":"'ANEXO INVERSIÓN'!E46","v":0},{"$f":"'ANEXO INVERSIÓN'!F46","v":0}]
[]
[]
[]
[]
[]
[]
[null,"RESUMEN INVERSIÓN INICIAL / FINANCIACIÓN"]
[]
[]
[null,"Resumen Cuadro Inversión / Financiación"]
[]
[null,"INVERSIÓN","IVA incluido",null,null,null,"FINANCIACIÓN"]
[null,"Gastos Establecimiento",{"$f":"D19","v":0},null,null,null,"Fondos Propios",{"$f":"H22","v":0}]
[null,"Activo No Corriente",{"$f":"D30","v":0},null,null,null,"Financiación Ajena L/P",{"$f":"H27","v":0}]
[null,"Activo Corriente",{"$f":"D47","v":0},null,null,null,"Financiación Ajena C/P",{"$f":"H31","v":0}]
[null,"TOTAL INVERSION ",{"$f":"SUM(C71:C73)","v":0},null,null,null,"TOTAL FINANCIACIÓN ",{"$f":"SUM(H71:H73)","v":0}]
[]
[null," "]
[]
[]
[]
[null,"Resumen estructura financiación"]
[]
[null,"Estructura de Financiación Necesaria"]
[null,"FINANCIACIÓN","%","TOTAL"]
[null,"F. Propia",{"$f":"+IFERROR(D84/$D$86,0)","v":0},{"$f":"+H71","v":0}]
[null,"F. Ajena",{"$f":"+IFERROR(D85/$D$86,0)","v":0},{"$f":"+D86-D84","v":0}]
[null,"TOTAL FINANCIACION",{"$f":"C85+C84","v":0},{"$f":"C74","v":0}]
[]
[]
[]
[]
[null,"Inversion inicial total ",null,null,null,"Financiación inicial total "]
[]
[]
[]
[]
[]
[]
[]
[]
[]
[]
[]
[]
[]
[]
[]
[]
[]
[]
[]
[]
[]
[]
[]
[]
[]
[]
[]
[]
[]
[]
[]
[]
[]
[]
[]
[]
[]
[null,"Amortizaciones despues del primer año "]
[]
[null,"AMORTIZACION DESPUES DEL PRIMER AÑO ",null,null,null,null,"AMORTIZACION ACUMULADA"]
[null,"TIPO DE INVERSION ","AÑO 1","AÑO 2","AÑO 3","AÑO 4","Amortizacion anual %","AÑO 1","AÑO 2","AÑO 3","AÑO 4"]
[null,{"$f":"IF('ANEXO INVERSIÓN'!I22=\"\",\"\",'ANEXO INVERSIÓN'!I22)","v":"Terrenos y bienes naturales"},{"$f":"IF('ANEXO INVERSIÓN'!J22<>\"\",'ANEXO INVERSIÓN'!J22,0)","v":0},{"$f":"IF('ANEXO INVERSIÓN'!K22<>\"\",'ANEXO INVERSIÓN'!K23,0)","v":0},{"$f":"IF('ANEXO INVERSIÓN'!L22<>\"\",'ANEXO INVERSIÓN'!L23,0)","v":0},{"$f":"IF('ANEXO INVERSIÓN'!M22<>\"\",'ANEXO INVERSIÓN'!M22,0)","v":0},{"$f":"'ANEXO INVERSIÓN'!N22","v":0.03},{"$f":"+C133","v":0},{"$f":"+H133+D133","v":0},{"$f":"+E133+D133","v":0},{"$f":"+F133+E133","v":0}]
[null,{"$f":"IF('ANEXO INVERSIÓN'!I23=\"\",\"\",'ANEXO INVERSIÓN'!I23)","v":"Construcciones"},{"$f":"IF('ANEXO INVERSIÓN'!J23<>\"\",'ANEXO INVERSIÓN'!J23,0)","v":0},{"$f":"IF('ANEXO INVERSIÓN'!K23<>\"\",'ANEXO INVERSIÓN'!K24,0)","v":0},{"$f":"IF('ANEXO INVERSIÓN'!L23<>\"\",'ANEXO INVERSIÓN'!L24,0)","v":0},{"$f":"IF('ANEXO INVERSIÓN'!M23<>\"\",'ANEXO INVERSIÓN'!M23,0)","v":0},{"$f":"'ANEXO INVERSIÓN'!N23","v":0.1},{"$f":"+C134","v":0},{"$f":"+H134+D134","v":0},{"$f":"+E134+D134","v":0},{"$f":"+F134+E134","v":0}]
[null,{"$f":"IF('ANEXO INVERSIÓN'!I24=\"\",\"\",'ANEXO INVERSIÓN'!I24)","v":"Maquinaria"},{"$f":"IF('ANEXO INVERSIÓN'!J24<>\"\",'ANEXO INVERSIÓN'!J24,0)","v":0},{"$f":"IF('ANEXO INVERSIÓN'!K24<>\"\",'ANEXO INVERSIÓN'!K25,0)","v":0},{"$f":"IF('ANEXO INVERSIÓN'!L24<>\"\",'ANEXO INVERSIÓN'!L25,0)","v":0},{"$f":"IF('ANEXO INVERSIÓN'!M24<>\"\",'ANEXO INVERSIÓN'!M24,0)","v":0},{"$f":"'ANEXO INVERSIÓN'!N24","v":0.13},0,0,0,0]
[null,{"$f":"IF('ANEXO INVERSIÓN'!I25=\"\",\"\",'ANEXO INVERSIÓN'!I25)","v":"Utillaje y herramienta"},{"$f":"IF('ANEXO INVERSIÓN'!J25<>\"\",'ANEXO INVERSIÓN'!J25,0)","v":0},{"$f":"IF('ANEXO INVERSIÓN'!K25<>\"\",'ANEXO INVERSIÓN'!K26,0)","v":0},{"$f":"IF('ANEXO INVERSIÓN'!L25<>\"\",'ANEXO INVERSIÓN'!L26,0)","v":0},{"$f":"IF('ANEXO INVERSIÓN'!M25<>\"\",'ANEXO INVERSIÓN'!M25,0)","v":0},{"$f":"'ANEXO INVERSIÓN'!N25","v":0.2},0,0,0,0]
[null,{"$f":"IF('ANEXO INVERSIÓN'!I26=\"\",\"\",'ANEXO INVERSIÓN'!I26)","v":"Instalación de riego "},{"$f":"IF('ANEXO INVERSIÓN'!J26<>\"\",'ANEXO INVERSIÓN'!J26,0)","v":0},{"$f":"IF('ANEXO INVERSIÓN'!K26<>\"\",'ANEXO INVERSIÓN'!K28,0)","v":0},{"$f":"IF('ANEXO INVERSIÓN'!L26<>\"\",'ANEXO INVERSIÓN'!L28,0)","v":0},{"$f":"IF('ANEXO INVERSIÓN'!M26<>\"\",'ANEXO INVERSIÓN'!M26,0)","v":0},{"$f":"'ANEXO INVERSIÓN'!N26","v":0.1},0,0,0,0]
[null,{"$f":"IF('ANEXO INVERSIÓN'!I27=\"\",\"\",'ANEXO INVERSIÓN'!I27)","v":"Otras instalaciones "},{"$f":"IF('ANEXO INVERSIÓN'!J27<>\"\",'ANEXO INVERSIÓN'!J27,0)","v":0},{"$f":"IF('ANEXO INVERSIÓN'!K27<>\"\",'ANEXO INVERSIÓN'!K29,0)","v":0},{"$f":"IF('ANEXO INVERSIÓN'!L27<>\"\",'ANEXO INVERSIÓN'!L29,0)","v":0},{"$f":"IF('ANEXO INVERSIÓN'!M27<>\"\",'ANEXO INVERSIÓN'!M27,0)","v":0},{"$f":"'ANEXO INVERSIÓN'!N27","v":0.1},{"$f":"+C138","v":0},{"$f":"+H138+D138","v":0},{"$f":"+E138+D138","v":0},{"$f":"+F138+E138","v":0}]
[null,{"$f":"IF('ANEXO INVERSIÓN'!I28=\"\",\"\",'ANEXO INVERSIÓN'!I28)","v":"Mobiliario"},{"$f":"IF('ANEXO INVERSIÓN'!J28<>\"\",'ANEXO INVERSIÓN'!J28,0)","v":0},{"$f":"IF('ANEXO INVERSIÓN'!K28<>\"\",'ANEXO INVERSIÓN'!K29,0)","v":0},{"$f":"IF('ANEXO INVERSIÓN'!L28<>\"\",'ANEXO INVERSIÓN'!L29,0)","v":0},{"$f":"IF('ANEXO INVERSIÓN'!M28<>\"\",'ANEXO INVERSIÓN'!M28,0)","v":0},{"$f":"'ANEXO INVERSIÓN'!N28","v":0.1},0,0,0,0]
[null,{"$f":"IF('ANEXO INVERSIÓN'!I29=\"\",\"\",'ANEXO INVERSIÓN'!I29)","v":"Equipos para proceso de información"},{"$f":"IF('ANEXO INVERSIÓN'!J29<>\"\",'ANEXO INVERSIÓN'!J29,0)","v":0},{"$f":"IF('ANEXO INVERSIÓN'!K29<>\"\",'ANEXO INVERSIÓN'!K30,0)","v":0},{"$f":"IF('ANEXO INVERSIÓN'!L29<>\"\",'ANEXO INVERSIÓN'!L30,0)","v":0},{"$f":"IF('ANEXO INVERSIÓN'!M29<>\"\",'ANEXO INVERSIÓN'!M29,0)","v":0},{"$f":"'ANEXO INVERSIÓN'!N29","v":0.25},0,0,0,0]
[null,{"$f":"IF('ANEXO INVERSIÓN'!I30=\"\",\"\",'ANEXO INVERSIÓN'!I30)","v":"Elementos de transporte"},{"$f":"IF('ANEXO INVERSIÓN'!J30<>\"\",'ANEXO INVERSIÓN'!J30,0)","v":0},{"$f":"IF('ANEXO INVERSIÓN'!K30<>\"\",'ANEXO INVERSIÓN'!K31,0)","v":0},{"$f":"IF('ANEXO INVERSIÓN'!L30<>\"\",'ANEXO INVERSIÓN'!L31,0)","v":0},{"$f":"IF('ANEXO INVERSIÓN'!M30<>\"\",'ANEXO INVERSIÓN'!M30,0)","v":0},{"$f":"'ANEXO INVERSIÓN'!N30","v":0.15},0,0,0,0]
[null,{"$f":"IF('ANEXO INVERSIÓN'!I31=\"\",\"\",'ANEXO INVERSIÓN'!I31)","v":"Gastos de inv.y des., pro. intelectual y derechos de traspaso"},{"$f":"IF('ANEXO INVERSIÓN'!J31<>\"\",'ANEXO INVERSIÓN'!J31,0)","v":0},{"$f":"IF('ANEXO INVERSIÓN'!K31<>\"\",'ANEXO INVERSIÓN'!K32,0)","v":0},{"$f":"IF('ANEXO INVERSIÓN'!L31<>\"\",'ANEXO INVERSIÓN'!L32,0)","v":0},{"$f":"IF('ANEXO INVERSIÓN'!M31<>\"\",'ANEXO INVERSIÓN'!M31,0)","v":0},{"$f":"'ANEXO INVERSIÓN'!N31","v":0.2},0,0,0,0]
[null,{"$f":"IF('ANEXO INVERSIÓN'!I32=\"\",\"\",'ANEXO INVERSIÓN'!I32)","v":"Aplicaciones informáticas"},{"$f":"IF('ANEXO INVERSIÓN'!J32<>\"\",'ANEXO INVERSIÓN'!J32,0)","v":0},{"$f":"IF('ANEXO INVERSIÓN'!K32<>\"\",'ANEXO INVERSIÓN'!K33,0)","v":0},{"$f":"IF('ANEXO INVERSIÓN'!L32<>\"\",'ANEXO INVERSIÓN'!L33,0)","v":0},{"$f":"IF('ANEXO INVERSIÓN'!M32<>\"\",'ANEXO INVERSIÓN'!M32,0)","v":0},{"$f":"'ANEXO INVERSIÓN'!N32","v":0.1},0,0,0,0]
[null,{"$f":"IF('ANEXO INVERSIÓN'!I33=\"\",\"\",'ANEXO INVERSIÓN'!I33)","v":""},{"$f":"IF('ANEXO INVERSIÓN'!J33<>\"\",'ANEXO INVERSIÓN'!J33,0)","v":0},{"$f":"IF('ANEXO INVERSIÓN'!K33<>\"\",'ANEXO INVERSIÓN'!K34,0)","v":0},{"$f":"IF('ANEXO INVERSIÓN'!L33<>\"\",'ANEXO INVERSIÓN'!L34,0)","v":0},{"$f":"IF('ANEXO INVERSIÓN'!M33<>\"\",'ANEXO INVERSIÓN'!M33,0)","v":0},{"$f":"'ANEXO INVERSIÓN'!N33","v":0},0,0,0,0]
[null,{"$f":"IF('ANEXO INVERSIÓN'!I34=\"\",\"\",'ANEXO INVERSIÓN'!I34)","v":""},{"$f":"IF('ANEXO INVERSIÓN'!J34<>\"\",'ANEXO INVERSIÓN'!J34,0)","v":0},{"$f":"IF('ANEXO INVERSIÓN'!K34<>\"\",'ANEXO INVERSIÓN'!K35,0)","v":0},{"$f":"IF('ANEXO INVERSIÓN'!L34<>\"\",'ANEXO INVERSIÓN'!L35,0)","v":0},{"$f":"IF('ANEXO INVERSIÓN'!M34<>\"\",'ANEXO INVERSIÓN'!M34,0)","v":0},{"$f":"'ANEXO INVERSIÓN'!N34","v":0},0,0,0,0]
[null,{"$f":"IF('ANEXO INVERSIÓN'!I35=\"\",\"\",'ANEXO INVERSIÓN'!I35)","v":""},{"$f":"IF('ANEXO INVERSIÓN'!J35<>\"\",'ANEXO INVERSIÓN'!J35,0)","v":0},{"$f":"IF('ANEXO INVERSIÓN'!K35<>\"\",'ANEXO INVERSIÓN'!K36,0)","v":0},{"$f":"IF('ANEXO INVERSIÓN'!L35<>\"\",'ANEXO INVERSIÓN'!L36,0)","v":0},{"$f":"IF('ANEXO INVERSIÓN'!M35<>\"\",'ANEXO INVERSIÓN'!M35,0)","v":0},{"$f":"'ANEXO INVERSIÓN'!N35","v":0},0,0,0,0]
[null,"TOTALES ",{"$f":"SUM(C133:C146)","v":0},{"$f":"SUM(D133:D146)","v":0},{"$f":"SUM(E133:E146)","v":0},{"$f":"SUM(F133:F146)","v":0},null,{"$f":"SUM(H133:H146)","v":0},{"$f":"SUM(I133:I146)","v":0},{"$f":"SUM(J133:J146)","v":0},{"$f":"SUM(K133:K146)","v":0}]
[]
[]
[null,"Inversiones realizadas despues del primer año "]
[]
[null,"AMORTIZACION DESPUES DEL PRIMER AÑO "]
[null,"TIPO DE INVERSION ","AÑO 1","AÑO 2","AÑO 3","AÑO 4"]
[null,{"$f":"+B133","v":"Terrenos y bienes naturales"},{"$f":"+'ANEXO INVERSIÓN'!P22","v":0},{"$f":"+'ANEXO INVERSIÓN'!Q22","v":0},{"$f":"+'ANEXO INVERSIÓN'!R22","v":0},{"$f":"+'ANEXO INVERSIÓN'!S22","v":0}]
[null,{"$f":"+B134","v":"Construcciones"},{"$f":"+'ANEXO INVERSIÓN'!P23","v":0},{"$f":"+'ANEXO INVERSIÓN'!Q23","v":0},{"$f":"+'ANEXO INVERSIÓN'!R23","v":0},{"$f":"+'ANEXO INVERSIÓN'!S23","v":0}]
[null,"Maquinaria",{"$f":"+'ANEXO INVERSIÓN'!P24","v":0},{"$f":"+'ANEXO INVERSIÓN'!Q24","v":0},{"$f":"+'ANEXO INVERSIÓN'!R24","v":0},{"$f":"+'ANEXO INVERSIÓN'!S24","v":0}]
[null,"Utillaje y herramienta",{"$f":"+'ANEXO INVERSIÓN'!P25","v":0},{"$f":"+'ANEXO INVERSIÓN'!Q25","v":0},{"$f":"+'ANEXO INVERSIÓN'!R25","v":0},{"$f":"+'ANEXO INVERSIÓN'!S25","v":0}]
[null,"Instalación de riego ",{"$f":"+'ANEXO INVERSIÓN'!P26","v":0},{"$f":"+'ANEXO INVERSIÓN'!Q26","v":0},{"$f":"+'ANEXO INVERSIÓN'!R26","v":0},{"$f":"+'ANEXO INVERSIÓN'!S26","v":0}]
[null,"Otras instalaciones ",{"$f":"+'ANEXO INVERSIÓN'!P27","v":0},{"$f":"+'ANEXO INVERSIÓN'!Q27","v":0},{"$f":"+'ANEXO INVERSIÓN'!R27","v":0},{"$f":"+'ANEXO INVERSIÓN'!S27","v":0}]
[null,"Mobiliario",{"$f":"+'ANEXO INVERSIÓN'!P28","v":0},{"$f":"+'ANEXO INVERSIÓN'!Q28","v":0},{"$f":"+'ANEXO INVERSIÓN'!R28","v":0},{"$f":"+'ANEXO INVERSIÓN'!S28","v":0}]
[null,"Equipos para proceso de información",{"$f":"+'ANEXO INVERSIÓN'!P29","v":0},{"$f":"+'ANEXO INVERSIÓN'!Q29","v":0},{"$f":"+'ANEXO INVERSIÓN'!R29","v":0},{"$f":"+'ANEXO INVERSIÓN'!S29","v":0}]
[null,"Elementos de transporte",{"$f":"+'ANEXO INVERSIÓN'!P30","v":0},{"$f":"+'ANEXO INVERSIÓN'!Q30","v":0},{"$f":"+'ANEXO INVERSIÓN'!R30","v":0},{"$f":"+'ANEXO INVERSIÓN'!S30","v":0}]
[null,"Gastos de inv.y des., pro. intelectual y derechos de traspaso",{"$f":"+'ANEXO INVERSIÓN'!P31","v":0},{"$f":"+'ANEXO INVERSIÓN'!Q31","v":0},{"$f":"+'ANEXO INVERSIÓN'!R31","v":0},{"$f":"+'ANEXO INVERSIÓN'!S31","v":0}]
[null,"Aplicaciones informáticas",{"$f":"+'ANEXO INVERSIÓN'!P32","v":0},{"$f":"+'ANEXO INVERSIÓN'!Q32","v":0},{"$f":"+'ANEXO INVERSIÓN'!R32","v":0},{"$f":"+'ANEXO INVERSIÓN'!S32","v":0}]
[null,"",{"$f":"+'ANEXO INVERSIÓN'!P33","v":0},{"$f":"+'ANEXO INVERSIÓN'!Q33","v":0},{"$f":"+'ANEXO INVERSIÓN'!R33","v":0},{"$f":"+'ANEXO INVERSIÓN'!S33","v":0}]
[null,"",{"$f":"+'ANEXO INVERSIÓN'!P34","v":0},{"$f":"+'ANEXO INVERSIÓN'!Q34","v":0},{"$f":"+'ANEXO INVERSIÓN'!R34","v":0},{"$f":"+'ANEXO INVERSIÓN'!S34","v":0}]
[null,"",{"$f":"+'ANEXO INVERSIÓN'!P35","v":0},{"$f":"+'ANEXO INVERSIÓN'!Q35","v":0},{"$f":"+'ANEXO INVERSIÓN'!R35","v":0},{"$f":"+'ANEXO INVERSIÓN'!S35","v":0}]
[null,"TOTALES ",{"$f":"SUM(C154:C167)","v":0},{"$f":"SUM(D154:D167)","v":0},{"$f":"SUM(E154:E167)","v":0},{"$f":"SUM(F154:F167)","v":0}]

{"sheet":"4.INGRESOS","index":11,"n_rows":74,"n_cols":16,"rows_kept":74,"cut":false,"hidden":false,"merged":[]}
[]
[null,"Volver al Indice "]
[null,"Consultar anexo ingresos "]
[]
[]
[]
[]
[null,null,"INGRESOS POR VENTA DE PRODUCTOS O SERVICIOS Y OTROS INGRESOS ( sin IVA )"]
[]
[]
[null,null,null,"Mes 1","Mes 2","Mes 3","Mes 4","Mes 5","Mes 6","Mes 7","Mes 8","Mes 9","Mes 10","Mes 11","Mes 12"]
[null,null,null,{"$f":"'7.CUENTA DE RESULTADOS '!C20","v":"1900enero"},{"$f":"'7.CUENTA DE RESULTADOS '!D20","v":"1900enero"},{"$f":"'7.CUENTA DE RESULTADOS '!E20","v":"1900febrero"},{"$f":"'7.CUENTA DE RESULTADOS '!F20","v":"1900marzo"},{"$f":"'7.CUENTA DE RESULTADOS '!G20","v":"1900abril"},{"$f":"'7.CUENTA DE RESULTADOS '!H20","v":"1900mayo"},{"$f":"'7.CUENTA DE RESULTADOS '!I20","v":"1900junio"},{"$f":"'7.CUENTA DE RESULTADOS '!J20","v":"1900julio"},{"$f":"'7.CUENTA DE RESULTADOS '!K20","v":"1900agosto"},{"$f":"'7.CUENTA DE RESULTADOS '!L20","v":"1900septiembre"},{"$f":"'7.CUENTA DE RESULTADOS '!M20","v":"1900octubre"},{"$f":"'7.CUENTA DE RESULTADOS '!N20","v":"1900noviembre"},"TOTAL"]
[null,null,"TOTAL INGRESOS POR VENTA DE PRODUCTOS/SERVICIOS",{"$f":"+D49","v":0},0,0,0,0,0,0,0,0,0,0,0,0]
[null,null,"TOTAL OTROS INGRESOS",{"$f":"+D64","v":0},0,0,0,0,0,0,0,0,0,0,0,0]
[null,null,"TOTAL IVA INGRESOS POR VENTA DE PRODUCTOS/SERVICIOS",{"$f":"+SUMPRODUCT($B$22:$B$48,D22:D48)","v":0},{"$f":"+SUMPRODUCT($B$22:$B$48,E22:E48)","v":0},0,0,0,0,0,0,0,0,0,0,{"$f":"+P65","v":0}]
[null,null,"TOTAL IVA OTROS INGRESOS",{"$f":"+SUMPRODUCT($B$53:$B$63,D53:D63)","v":0},{"$f":"+SUMPRODUCT($B$53:$B$63,E53:E63)","v":0},0,0,0,0,0,0,0,0,0,0,{"$f":"+P66","v":0}]
[null,null,"TOTAL INGRESOS",{"$f":"+D13+D14","v":0},0,0,0,0,0,0,0,0,0,0,0,{"$f":"+P13+P14+P15+P16","v":0}]
[]
[]
[null,"Columna1"," ","Mes 1","Mes 2","Mes 3","Mes 4","Mes 5","Mes 6","Mes 7","Mes 8","Mes 9","Mes 10","Mes 11","Mes 12","Columna3"]
[null,"IVA %","Ingresos por venta de productos o servicios ",{"$f":"'7.CUENTA DE RESULTADOS '!C20","v":"1900enero"},{"$f":"'7.CUENTA DE RESULTADOS '!D20","v":"1900enero"},{"$f":"'7.CUENTA DE RESULTADOS '!E20","v":"1900febrero"},{"$f":"'7.CUENTA DE RESULTADOS '!F20","v":"1900marzo"},{"$f":"'7.CUENTA DE RESULTADOS '!G20","v":"1900abril"},{"$f":"'7.CUENTA DE RESULTADOS '!H20","v":"1900mayo"},{"$f":"'7.CUENTA DE RESULTADOS '!I20","v":"1900junio"},{"$f":"'7.CUENTA DE RESULTADOS '!J20","v":"1900julio"},{"$f":"'7.CUENTA DE RESULTADOS '!K20","v":"1900agosto"},{"$f":"'7.CUENTA DE RESULTADOS '!L20","v":"1900septiembre"},{"$f":"'7.CUENTA DE RESULTADOS '!M20","v":"1900octubre"},{"$f":"'7.CUENTA DE RESULTADOS '!N20","v":"1900noviembre"},"TOTAL"]
[null,{"$f":"IF('ANEXO INGRESOS'!D14=\"\",\"\",'ANEXO INGRESOS'!C14)","v":""},{"$f":"IF('ANEXO INGRESOS'!D14=\"\",\"\",'ANEXO INGRESOS'!D14)","v":""},{"$f":"IF(Ingresos[[#This Row],[ ]]<>\"\",'ANEXO INGRESOS'!H14*'ANEXO INGRESOS'!$F14,\"\")","v":""},{"$f":"IF(Ingresos[[#This Row],[ ]]<>\"\",'ANEXO INGRESOS'!I14*'ANEXO INGRESOS'!$F14,\"\")","v":""},{"$f":"IF(Ingresos[[#This Row],[ ]]<>\"\",'ANEXO INGRESOS'!J14*'ANEXO INGRESOS'!$F14,\"\")","v":""},{"$f":"IF(Ingresos[[#This Row],[ ]]<>\"\",'ANEXO INGRESOS'!K14*'ANEXO INGRESOS'!$F14,\"\")","v":""},{"$f":"IF(Ingresos[[#This Row],[ ]]<>\"\",'ANEXO INGRESOS'!L14*'ANEXO INGRESOS'!$F14,\"\")","v":""},{"$f":"IF(Ingresos[[#This Row],[ ]]<>\"\",'ANEXO INGRESOS'!M14*'ANEXO INGRESOS'!$F14,\"\")","v":""},{"$f":"IF(Ingresos[[#This Row],[ ]]<>\"\",'ANEXO INGRESOS'!N14*'ANEXO INGRESOS'!$F14,\"\")","v":""},{"$f":"IF(Ingresos[[#This Row],[ ]]<>\"\",'ANEXO INGRESOS'!O14*'ANEXO INGRESOS'!$F14,\"\")","v":""},{"$f":"IF(Ingresos[[#This Row],[ ]]<>\"\",'ANEXO INGRESOS'!P14*'ANEXO INGRESOS'!$F14,\"\")","v":""},{"$f":"IF(Ingresos[[#This Row],[ ]]<>\"\",'ANEXO INGRESOS'!Q14*'ANEXO INGRESOS'!$F14,\"\")","v":""},{"$f":"IF(Ingresos[[#This Row],[ ]]<>\"\",'ANEXO INGRESOS'!R14*'ANEXO INGRESOS'!$F14,\"\")","v":""},{"$f":"IF(Ingresos[[#This Row],[ ]]<>\"\",'ANEXO INGRESOS'!S14*'ANEXO INGRESOS'!$F14,\"\")","v":""},{"$f":"IF(Ingresos[[#This Row],[ ]]=\"\",\"\",SUM(D22:O22))","v":""}]
[null,{"$f":"IF('ANEXO INGRESOS'!D15=\"\",\"\",'ANEXO INGRESOS'!C15)","v":""},{"$f":"IF('ANEXO INGRESOS'!D15=\"\",\"\",'ANEXO INGRESOS'!D15)","v":""},{"$f":"IF(Ingresos[[#This Row],[ ]]<>\"\",'ANEXO INGRESOS'!H15*'ANEXO INGRESOS'!$F15,\"\")","v":""},{"$f":"IF(Ingresos[[#This Row],[ ]]<>\"\",'ANEXO INGRESOS'!I15*'ANEXO INGRESOS'!$F15,\"\")","v":""},{"$f":"IF(Ingresos[[#This Row],[ ]]<>\"\",'ANEXO INGRESOS'!J15*'ANEXO INGRESOS'!$F15,\"\")","v":""},{"$f":"IF(Ingresos[[#This Row],[ ]]<>\"\",'ANEXO INGRESOS'!K15*'ANEXO INGRESOS'!$F15,\"\")","v":""},{"$f":"IF(Ingresos[[#This Row],[ ]]<>\"\",'ANEXO INGRESOS'!L15*'ANEXO INGRESOS'!$F15,\"\")","v":""},{"$f":"IF(Ingresos[[#This Row],[ ]]<>\"\",'ANEXO INGRESOS'!M15*'ANEXO INGRESOS'!$F15,\"\")","v":""},{"$f":"IF(Ingresos[[#This Row],[ ]]<>\"\",'ANEXO INGRESOS'!N15*'ANEXO INGRESOS'!$F15,\"\")","v":""},{"$f":"IF(Ingresos[[#This Row],[ ]]<>\"\",'ANEXO INGRESOS'!O15*'ANEXO INGRESOS'!$F15,\"\")","v":""},{"$f":"IF(Ingresos[[#This Row],[ ]]<>\"\",'ANEXO INGRESOS'!P15*'ANEXO INGRESOS'!$F15,\"\")","v":""},{"$f":"IF(Ingresos[[#This Row],[ ]]<>\"\",'ANEXO INGRESOS'!Q15*'ANEXO INGRESOS'!$F15,\"\")","v":""},{"$f":"IF(Ingresos[[#This Row],[ ]]<>\"\",'ANEXO INGRESOS'!R15*'ANEXO INGRESOS'!$F15,\"\")","v":""},{"$f":"IF(Ingresos[[#This Row],[ ]]<>\"\",'ANEXO INGRESOS'!S15*'ANEXO INGRESOS'!$F15,\"\")","v":""},{"$f":"IF(Ingresos[[#This Row],[ ]]=\"\",\"\",SUM(D23:O23))","v":""}]
[null,{"$f":"IF('ANEXO INGRESOS'!D16=\"\",\"\",'ANEXO INGRESOS'!C16)","v":""},{"$f":"IF('ANEXO INGRESOS'!D16=\"\",\"\",'ANEXO INGRESOS'!D16)","v":""},{"$f":"IF(Ingresos[[#This Row],[ ]]<>\"\",'ANEXO INGRESOS'!H16*'ANEXO INGRESOS'!$F16,\"\")","v":""},{"$f":"IF(Ingresos[[#This Row],[ ]]<>\"\",'ANEXO INGRESOS'!I16*'ANEXO INGRESOS'!$F16,\"\")","v":""},{"$f":"IF(Ingresos[[#This Row],[ ]]<>\"\",'ANEXO INGRESOS'!J16*'ANEXO INGRESOS'!$F16,\"\")","v":""},{"$f":"IF(Ingresos[[#This Row],[ ]]<>\"\",'ANEXO INGRESOS'!K16*'ANEXO INGRESOS'!$F16,\"\")","v":""},{"$f":"IF(Ingresos[[#This Row],[ ]]<>\"\",'ANEXO INGRESOS'!L16*'ANEXO INGRESOS'!$F16,\"\")","v":""},{"$f":"IF(Ingresos[[#This Row],[ ]]<>\"\",'ANEXO INGRESOS'!M16*'ANEXO INGRESOS'!$F16,\"\")","v":""},{"$f":"IF(Ingresos[[#This Row],[ ]]<>\"\",'ANEXO INGRESOS'!N16*'ANEXO INGRESOS'!$F16,\"\")","v":""},{"$f":"IF(Ingresos[[#This Row],[ ]]<>\"\",'ANEXO INGRESOS'!O16*'ANEXO INGRESOS'!$F16,\"\")","v":""},{"$f":"IF(Ingresos[[#This Row],[ ]]<>\"\",'ANEXO INGRESOS'!P16*'ANEXO INGRESOS'!$F16,\"\")","v":""},{"$f":"IF(Ingresos[[#This Row],[ ]]<>\"\",'ANEXO INGRESOS'!Q16*'ANEXO INGRESOS'!$F16,\"\")","v":""},{"$f":"IF(Ingresos[[#This Row],[ ]]<>\"\",'ANEXO INGRESOS'!R16*'ANEXO INGRESOS'!$F16,\"\")","v":""},{"$f":"IF(Ingresos[[#This Row],[ ]]<>\"\",'ANEXO INGRESOS'!S16*'ANEXO INGRESOS'!$F16,\"\")","v":""},{"$f":"IF(Ingresos[[#This Row],[ ]]=\"\",\"\",SUM(D24:O24))","v":""}]
[null,{"$f":"IF('ANEXO INGRESOS'!D17=\"\",\"\",'ANEXO INGRESOS'!C17)","v":""},{"$f":"IF('ANEXO INGRESOS'!D17=\"\",\"\",'ANEXO INGRESOS'!D17)","v":""},{"$f":"IF(Ingresos[[#This Row],[ ]]<>\"\",'ANEXO INGRESOS'!H17*'ANEXO INGRESOS'!$F17,\"\")","v":""},{"$f":"IF(Ingresos[[#This Row],[ ]]<>\"\",'ANEXO INGRESOS'!I17*'ANEXO INGRESOS'!$F17,\"\")","v":""},{"$f":"IF(Ingresos[[#This Row],[ ]]<>\"\",'ANEXO INGRESOS'!J17*'ANEXO INGRESOS'!$F17,\"\")","v":""},{"$f":"IF(Ingresos[[#This Row],[ ]]<>\"\",'ANEXO INGRESOS'!K17*'ANEXO INGRESOS'!$F17,\"\")","v":""},{"$f":"IF(Ingresos[[#This Row],[ ]]<>\"\",'ANEXO INGRESOS'!L17*'ANEXO INGRESOS'!$F17,\"\")","v":""},{"$f":"IF(Ingresos[[#This Row],[ ]]<>\"\",'ANEXO INGRESOS'!M17*'ANEXO INGRESOS'!$F17,\"\")","v":""},{"$f":"IF(Ingresos[[#This Row],[ ]]<>\"\",'ANEXO INGRESOS'!N17*'ANEXO INGRESOS'!$F17,\"\")","v":""},{"$f":"IF(Ingresos[[#This Row],[ ]]<>\"\",'ANEXO INGRESOS'!O17*'ANEXO INGRESOS'!$F17,\"\")","v":""},{"$f":"IF(Ingresos[[#This Row],[ ]]<>\"\",'ANEXO INGRESOS'!P17*'ANEXO INGRESOS'!$F17,\"\")","v":""},{"$f":"IF(Ingresos[[#This Row],[ ]]<>\"\",'ANEXO INGRESOS'!Q17*'ANEXO INGRESOS'!$F17,\"\")","v":""},{"$f":"IF(Ingresos[[#This Row],[ ]]<>\"\",'ANEXO INGRESOS'!R17*'ANEXO INGRESOS'!$F17,\"\")","v":""},{"$f":"IF(Ingresos[[#This Row],[ ]]<>\"\",'ANEXO INGRESOS'!S17*'ANEXO INGRESOS'!$F17,\"\")","v":""},{"$f":"IF(Ingresos[[#This Row],[ ]]=\"\",\"\",SUM(D25:O25))","v":""}]
[null,{"$f":"IF('ANEXO INGRESOS'!D18=\"\",\"\",'ANEXO INGRESOS'!C18)","v":""},{"$f":"IF('ANEXO INGRESOS'!D18=\"\",\"\",'ANEXO INGRESOS'!D18)","v":""},{"$f":"IF(Ingresos[[#This Row],[ ]]<>\"\",'ANEXO INGRESOS'!H18*'ANEXO INGRESOS'!$F18,\"\")","v":""},{"$f":"IF(Ingresos[[#This Row],[ ]]<>\"\",'ANEXO INGRESOS'!I18*'ANEXO INGRESOS'!$F18,\"\")","v":""},{"$f":"IF(Ingresos[[#This Row],[ ]]<>\"\",'ANEXO INGRESOS'!J18*'ANEXO INGRESOS'!$F18,\"\")","v":""},{"$f":"IF(Ingresos[[#This Row],[ ]]<>\"\",'ANEXO INGRESOS'!K18*'ANEXO INGRESOS'!$F18,\"\")","v":""},{"$f":"IF(Ingresos[[#This Row],[ ]]<>\"\",'ANEXO INGRESOS'!L18*'ANEXO INGRESOS'!$F18,\"\")","v":""},{"$f":"IF(Ingresos[[#This Row],[ ]]<>\"\",'ANEXO INGRESOS'!M18*'ANEXO INGRESOS'!$F18,\"\")","v":""},{"$f":"IF(Ingresos[[#This Row],[ ]]<>\"\",'ANEXO INGRESOS'!N18*'ANEXO INGRESOS'!$F18,\"\")","v":""},{"$f":"IF(Ingresos[[#This Row],[ ]]<>\"\",'ANEXO INGRESOS'!O18*'ANEXO INGRESOS'!$F18,\"\")","v":""},{"$f":"IF(Ingresos[[#This Row],[ ]]<>\"\",'ANEXO INGRESOS'!P18*'ANEXO INGRESOS'!$F18,\"\")","v":""},{"$f":"IF(Ingresos[[#This Row],[ ]]<>\"\",'ANEXO INGRESOS'!Q18*'ANEXO INGRESOS'!$F18,\"\")","v":""},{"$f":"IF(Ingresos[[#This Row],[ ]]<>\"\",'ANEXO INGRESOS'!R18*'ANEXO INGRESOS'!$F18,\"\")","v":""},{"$f":"IF(Ingresos[[#This Row],[ ]]<>\"\",'ANEXO INGRESOS'!S18*'ANEXO INGRESOS'!$F18,\"\")","v":""},{"$f":"IF(Ingresos[[#This Row],[ ]]=\"\",\"\",SUM(D26:O26))","v":""}]
[null,{"$f":"IF('ANEXO INGRESOS'!D19=\"\",\"\",'ANEXO INGRESOS'!C19)","v":""},{"$f":"IF('ANEXO INGRESOS'!D19=\"\",\"\",'ANEXO INGRESOS'!D19)","v":""},{"$f":"IF(Ingresos[[#This Row],[ ]]<>\"\",'ANEXO INGRESOS'!H19*'ANEXO INGRESOS'!$F19,\"\")","v":""},{"$f":"IF(Ingresos[[#This Row],[ ]]<>\"\",'ANEXO INGRESOS'!I19*'ANEXO INGRESOS'!$F19,\"\")","v":""},{"$f":"IF(Ingresos[[#This Row],[ ]]<>\"\",'ANEXO INGRESOS'!J19*'ANEXO INGRESOS'!$F19,\"\")","v":""},{"$f":"IF(Ingresos[[#This Row],[ ]]<>\"\",'ANEXO INGRESOS'!K19*'ANEXO INGRESOS'!$F19,\"\")","v":""},{"$f":"IF(Ingresos[[#This Row],[ ]]<>\"\",'ANEXO INGRESOS'!L19*'ANEXO INGRESOS'!$F19,\"\")","v":""},{"$f":"IF(Ingresos[[#This Row],[ ]]<>\"\",'ANEXO INGRESOS'!M19*'ANEXO INGRESOS'!$F19,\"\")","v":""},{"$f":"IF(Ingresos[[#This Row],[ ]]<>\"\",'ANEXO INGRESOS'!N19*'ANEXO INGRESOS'!$F19,\"\")","v":""},{"$f":"IF(Ingresos[[#This Row],[ ]]<>\"\",'ANEXO INGRESOS'!O19*'ANEXO INGRESOS'!$F19,\"\")","v":""},{"$f":"IF(Ingresos[[#This Row],[ ]]<>\"\",'ANEXO INGRESOS'!P19*'ANEXO INGRESOS'!$F19,\"\")","v":""},{"$f":"IF(Ingresos[[#This Row],[ ]]<>\"\",'ANEXO INGRESOS'!Q19*'ANEXO INGRESOS'!$F19,\"\")","v":""},{"$f":"IF(Ingresos[[#This Row],[ ]]<>\"\",'ANEXO INGRESOS'!R19*'ANEXO INGRESOS'!$F19,\"\")","v":""},{"$f":"IF(Ingresos[[#This Row],[ ]]<>\"\",'ANEXO INGRESOS'!S19*'ANEXO INGRESOS'!$F19,\"\")","v":""},{"$f":"IF(Ingresos[[#This Row],[ ]]=\"\",\"\",SUM(D27:O27))","v":""}]
[null,{"$f":"IF('ANEXO INGRESOS'!D20=\"\",\"\",'ANEXO INGRESOS'!C20)","v":""},{"$f":"IF('ANEXO INGRESOS'!D20=\"\",\"\",'ANEXO INGRESOS'!D20)","v":""},{"$f":"IF(Ingresos[[#This Row],[ ]]<>\"\",'ANEXO INGRESOS'!H20*'ANEXO INGRESOS'!$F20,\"\")","v":""},{"$f":"IF(Ingresos[[#This Row],[ ]]<>\"\",'ANEXO INGRESOS'!I20*'ANEXO INGRESOS'!$F20,\"\")","v":""},{"$f":"IF(Ingresos[[#This Row],[ ]]<>\"\",'ANEXO INGRESOS'!J20*'ANEXO INGRESOS'!$F20,\"\")","v":""},{"$f":"IF(Ingresos[[#This Row],[ ]]<>\"\",'ANEXO INGRESOS'!K20*'ANEXO INGRESOS'!$F20,\"\")","v":""},{"$f":"IF(Ingresos[[#This Row],[ ]]<>\"\",'ANEXO INGRESOS'!L20*'ANEXO INGRESOS'!$F20,\"\")","v":""},{"$f":"IF(Ingresos[[#This Row],[ ]]<>\"\",'ANEXO INGRESOS'!M20*'ANEXO INGRESOS'!$F20,\"\")","v":""},{"$f":"IF(Ingresos[[#This Row],[ ]]<>\"\",'ANEXO INGRESOS'!N20*'ANEXO INGRESOS'!$F20,\"\")","v":""},{"$f":"IF(Ingresos[[#This Row],[ ]]<>\"\",'ANEXO INGRESOS'!O20*'ANEXO INGRESOS'!$F20,\"\")","v":""},{"$f":"IF(Ingresos[[#This Row],[ ]]<>\"\",'ANEXO INGRESOS'!P20*'ANEXO INGRESOS'!$F20,\"\")","v":""},{"$f":"IF(Ingresos[[#This Row],[ ]]<>\"\",'ANEXO INGRESOS'!Q20*'ANEXO INGRESOS'!$F20,\"\")","v":""},{"$f":"IF(Ingresos[[#This Row],[ ]]<>\"\",'ANEXO INGRESOS'!R20*'ANEXO INGRESOS'!$F20,\"\")","v":""},{"$f":"IF(Ingresos[[#This Row],[ ]]<>\"\",'ANEXO INGRESOS'!S20*'ANEXO INGRESOS'!$F20,\"\")","v":""},{"$f":"IF(Ingresos[[#This Row],[ ]]=\"\",\"\",SUM(D28:O28))","v":""}]
[null,{"$f":"IF('ANEXO INGRESOS'!D21=\"\",\"\",'ANEXO INGRESOS'!C21)","v":""},{"$f":"IF('ANEXO INGRESOS'!D21=\"\",\"\",'ANEXO INGRESOS'!D21)","v":""},{"$f":"IF(Ingresos[[#This Row],[ ]]<>\"\",'ANEXO INGRESOS'!H21*'ANEXO INGRESOS'!$F21,\"\")","v":""},{"$f":"IF(Ingresos[[#This Row],[ ]]<>\"\",'ANEXO INGRESOS'!I21*'ANEXO INGRESOS'!$F21,\"\")","v":""},{"$f":"IF(Ingresos[[#This Row],[ ]]<>\"\",'ANEXO INGRESOS'!J21*'ANEXO INGRESOS'!$F21,\"\")","v":""},{"$f":"IF(Ingresos[[#This Row],[ ]]<>\"\",'ANEXO INGRESOS'!K21*'ANEXO INGRESOS'!$F21,\"\")","v":""},{"$f":"IF(Ingresos[[#This Row],[ ]]<>\"\",'ANEXO INGRESOS'!L21*'ANEXO INGRESOS'!$F21,\"\")","v":""},{"$f":"IF(Ingresos[[#This Row],[ ]]<>\"\",'ANEXO INGRESOS'!M21*'ANEXO INGRESOS'!$F21,\"\")","v":""},{"$f":"IF(Ingresos[[#This Row],[ ]]<>\"\",'ANEXO INGRESOS'!N21*'ANEXO INGRESOS'!$F21,\"\")","v":""},{"$f":"IF(Ingresos[[#This Row],[ ]]<>\"\",'ANEXO INGRESOS'!O21*'ANEXO INGRESOS'!$F21,\"\")","v":""},{"$f":"IF(Ingresos[[#This Row],[ ]]<>\"\",'ANEXO INGRESOS'!P21*'ANEXO INGRESOS'!$F21,\"\")","v":""},{"$f":"IF(Ingresos[[#This Row],[ ]]<>\"\",'ANEXO INGRESOS'!Q21*'ANEXO INGRESOS'!$F21,\"\")","v":""},{"$f":"IF(Ingresos[[#This Row],[ ]]<>\"\",'ANEXO INGRESOS'!R21*'ANEXO INGRESOS'!$F21,\"\")","v":""},{"$f":"IF(Ingresos[[#This Row],[ ]]<>\"\",'ANEXO INGRESOS'!S21*'ANEXO INGRESOS'!$F21,\"\")","v":""},{"$f":"IF(Ingresos[[#This Row],[ ]]=\"\",\"\",SUM(D29:O29))","v":""}]
[null,{"$f":"IF('ANEXO INGRESOS'!D22=\"\",\"\",'ANEXO INGRESOS'!C22)","v":""},{"$f":"IF('ANEXO INGRESOS'!D22=\"\",\"\",'ANEXO INGRESOS'!D22)","v":""},{"$f":"IF(Ingresos[[#This Row],[ ]]<>\"\",'ANEXO INGRESOS'!H22*'ANEXO INGRESOS'!$F22,\"\")","v":""},{"$f":"IF(Ingresos[[#This Row],[ ]]<>\"\",'ANEXO INGRESOS'!I22*'ANEXO INGRESOS'!$F22,\"\")","v":""},{"$f":"IF(Ingresos[[#This Row],[ ]]<>\"\",'ANEXO INGRESOS'!J22*'ANEXO INGRESOS'!$F22,\"\")","v":""},{"$f":"IF(Ingresos[[#This Row],[ ]]<>\"\",'ANEXO INGRESOS'!K22*'ANEXO INGRESOS'!$F22,\"\")","v":""},{"$f":"IF(Ingresos[[#This Row],[ ]]<>\"\",'ANEXO INGRESOS'!L22*'ANEXO INGRESOS'!$F22,\"\")","v":""},{"$f":"IF(Ingresos[[#This Row],[ ]]<>\"\",'ANEXO INGRESOS'!M22*'ANEXO INGRESOS'!$F22,\"\")","v":""},{"$f":"IF(Ingresos[[#This Row],[ ]]<>\"\",'ANEXO INGRESOS'!N22*'ANEXO INGRESOS'!$F22,\"\")","v":""},{"$f":"IF(Ingresos[[#This Row],[ ]]<>\"\",'ANEXO INGRESOS'!O22*'ANEXO INGRESOS'!$F22,\"\")","v":""},{"$f":"IF(Ingresos[[#This Row],[ ]]<>\"\",'ANEXO INGRESOS'!P22*'ANEXO INGRESOS'!$F22,\"\")","v":""},{"$f":"IF(Ingresos[[#This Row],[ ]]<>\"\",'ANEXO INGRESOS'!Q22*'ANEXO INGRESOS'!$F22,\"\")","v":""},{"$f":"IF(Ingresos[[#This Row],[ ]]<>\"\",'ANEXO INGRESOS'!R22*'ANEXO INGRESOS'!$F22,\"\")","v":""},{"$f":"IF(Ingresos[[#This Row],[ ]]<>\"\",'ANEXO INGRESOS'!S22*'ANEXO INGRESOS'!$F22,\"\")","v":""},{"$f":"IF(Ingresos[[#This Row],[ ]]=\"\",\"\",SUM(D30:O30))","v":""}]
[null,{"$f":"IF('ANEXO INGRESOS'!D23=\"\",\"\",'ANEXO INGRESOS'!C23)","v":""},{"$f":"IF('ANEXO INGRESOS'!D23=\"\",\"\",'ANEXO INGRESOS'!D23)","v":""},{"$f":"IF(Ingresos[[#This Row],[ ]]<>\"\",'ANEXO INGRESOS'!H23*'ANEXO INGRESOS'!$F23,\"\")","v":""},{"$f":"IF(Ingresos[[#This Row],[ ]]<>\"\",'ANEXO INGRESOS'!I23*'ANEXO INGRESOS'!$F23,\"\")","v":""},{"$f":"IF(Ingresos[[#This Row],[ ]]<>\"\",'ANEXO INGRESOS'!J23*'ANEXO INGRESOS'!$F23,\"\")","v":""},{"$f":"IF(Ingresos[[#This Row],[ ]]<>\"\",'ANEXO INGRESOS'!K23*'ANEXO INGRESOS'!$F23,\"\")","v":""},{"$f":"IF(Ingresos[[#This Row],[ ]]<>\"\",'ANEXO INGRESOS'!L23*'ANEXO INGRESOS'!$F23,\"\")","v":""},{"$f":"IF(Ingresos[[#This Row],[ ]]<>\"\",'ANEXO INGRESOS'!M23*'ANEXO INGRESOS'!$F23,\"\")","v":""},{"$f":"IF(Ingresos[[#This Row],[ ]]<>\"\",'ANEXO INGRESOS'!N23*'ANEXO INGRESOS'!$F23,\"\")","v":""},{"$f":"IF(Ingresos[[#This Row],[ ]]<>\"\",'ANEXO INGRESOS'!O23*'ANEXO INGRESOS'!$F23,\"\")","v":""},{"$f":"IF(Ingresos[[#This Row],[ ]]<>\"\",'ANEXO INGRESOS'!P23*'ANEXO INGRESOS'!$F23,\"\")","v":""},{"$f":"IF(Ingresos[[#This Row],[ ]]<>\"\",'ANEXO INGRESOS'!Q23*'ANEXO INGRESOS'!$F23,\"\")","v":""},{"$f":"IF(Ingresos[[#This Row],[ ]]<>\"\",'ANEXO INGRESOS'!R23*'ANEXO INGRESOS'!$F23,\"\")","v":""},{"$f":"IF(Ingresos[[#This Row],[ ]]<>\"\",'ANEXO INGRESOS'!S23*'ANEXO INGRESOS'!$F23,\"\")","v":""},{"$f":"IF(Ingresos[[#This Row],[ ]]=\"\",\"\",SUM(D31:O31))","v":""}]
[null,{"$f":"IF('ANEXO INGRESOS'!D24=\"\",\"\",'ANEXO INGRESOS'!C24)","v":""},{"$f":"IF('ANEXO INGRESOS'!D24=\"\",\"\",'ANEXO INGRESOS'!D24)","v":""},{"$f":"IF(Ingresos[[#This Row],[ ]]<>\"\",'ANEXO INGRESOS'!H24*'ANEXO INGRESOS'!$F24,\"\")","v":""},{"$f":"IF(Ingresos[[#This Row],[ ]]<>\"\",'ANEXO INGRESOS'!I24*'ANEXO INGRESOS'!$F24,\"\")","v":""},{"$f":"IF(Ingresos[[#This Row],[ ]]<>\"\",'ANEXO INGRESOS'!J24*'ANEXO INGRESOS'!$F24,\"\")","v":""},{"$f":"IF(Ingresos[[#This Row],[ ]]<>\"\",'ANEXO INGRESOS'!K24*'ANEXO INGRESOS'!$F24,\"\")","v":""},{"$f":"IF(Ingresos[[#This Row],[ ]]<>\"\",'ANEXO INGRESOS'!L24*'ANEXO INGRESOS'!$F24,\"\")","v":""},{"$f":"IF(Ingresos[[#This Row],[ ]]<>\"\",'ANEXO INGRESOS'!M24*'ANEXO INGRESOS'!$F24,\"\")","v":""},{"$f":"IF(Ingresos[[#This Row],[ ]]<>\"\",'ANEXO INGRESOS'!N24*'ANEXO INGRESOS'!$F24,\"\")","v":""},{"$f":"IF(Ingresos[[#This Row],[ ]]<>\"\",'ANEXO INGRESOS'!O24*'ANEXO INGRESOS'!$F24,\"\")","v":""},{"$f":"IF(Ingresos[[#This Row],[ ]]<>\"\",'ANEXO INGRESOS'!P24*'ANEXO INGRESOS'!$F24,\"\")","v":""},{"$f":"IF(Ingresos[[#This Row],[ ]]<>\"\",'ANEXO INGRESOS'!Q24*'ANEXO INGRESOS'!$F24,\"\")","v":""},{"$f":"IF(Ingresos[[#This Row],[ ]]<>\"\",'ANEXO INGRESOS'!R24*'ANEXO INGRESOS'!$F24,\"\")","v":""},{"$f":"IF(Ingresos[[#This Row],[ ]]<>\"\",'ANEXO INGRESOS'!S24*'ANEXO INGRESOS'!$F24,\"\")","v":""},{"$f":"IF(Ingresos[[#This Row],[ ]]=\"\",\"\",SUM(D32:O32))","v":""}]
[null,{"$f":"IF('ANEXO INGRESOS'!D25=\"\",\"\",'ANEXO INGRESOS'!C25)","v":""},{"$f":"IF('ANEXO INGRESOS'!D25=\"\",\"\",'ANEXO INGRESOS'!D25)","v":""},{"$f":"IF(Ingresos[[#This Row],[ ]]<>\"\",'ANEXO INGRESOS'!H25*'ANEXO INGRESOS'!$F25,\"\")","v":""},{"$f":"IF(Ingresos[[#This Row],[ ]]<>\"\",'ANEXO INGRESOS'!I25*'ANEXO INGRESOS'!$F25,\"\")","v":""},{"$f":"IF(Ingresos[[#This Row],[ ]]<>\"\",'ANEXO INGRESOS'!J25*'ANEXO INGRESOS'!$F25,\"\")","v":""},{"$f":"IF(Ingresos[[#This Row],[ ]]<>\"\",'ANEXO INGRESOS'!K25*'ANEXO INGRESOS'!$F25,\"\")","v":""},{"$f":"IF(Ingresos[[#This Row],[ ]]<>\"\",'ANEXO INGRESOS'!L25*'ANEXO INGRESOS'!$F25,\"\")","v":""},{"$f":"IF(Ingresos[[#This Row],[ ]]<>\"\",'ANEXO INGRESOS'!M25*'ANEXO INGRESOS'!$F25,\"\")","v":""},{"$f":"IF(Ingresos[[#This Row],[ ]]<>\"\",'ANEXO INGRESOS'!N25*'ANEXO INGRESOS'!$F25,\"\")","v":""},{"$f":"IF(Ingresos[[#This Row],[ ]]<>\"\",'ANEXO INGRESOS'!O25*'ANEXO INGRESOS'!$F25,\"\")","v":""},{"$f":"IF(Ingresos[[#This Row],[ ]]<>\"\",'ANEXO INGRESOS'!P25*'ANEXO INGRESOS'!$F25,\"\")","v":""},{"$f":"IF(Ingresos[[#This Row],[ ]]<>\"\",'ANEXO INGRESOS'!Q25*'ANEXO INGRESOS'!$F25,\"\")","v":""},{"$f":"IF(Ingresos[[#This Row],[ ]]<>\"\",'ANEXO INGRESOS'!R25*'ANEXO INGRESOS'!$F25,\"\")","v":""},{"$f":"IF(Ingresos[[#This Row],[ ]]<>\"\",'ANEXO INGRESOS'!S25*'ANEXO INGRESOS'!$F25,\"\")","v":""},{"$f":"IF(Ingresos[[#This Row],[ ]]=\"\",\"\",SUM(D33:O33))","v":""}]
[null,{"$f":"IF('ANEXO INGRESOS'!D26=\"\",\"\",'ANEXO INGRESOS'!C26)","v":""},{"$f":"IF('ANEXO INGRESOS'!D26=\"\",\"\",'ANEXO INGRESOS'!D26)","v":""},{"$f":"IF(Ingresos[[#This Row],[ ]]<>\"\",'ANEXO INGRESOS'!H26*'ANEXO INGRESOS'!$F26,\"\")","v":""},{"$f":"IF(Ingresos[[#This Row],[ ]]<>\"\",'ANEXO INGRESOS'!I26*'ANEXO INGRESOS'!$F26,\"\")","v":""},{"$f":"IF(Ingresos[[#This Row],[ ]]<>\"\",'ANEXO INGRESOS'!J26*'ANEXO INGRESOS'!$F26,\"\")","v":""},{"$f":"IF(Ingresos[[#This Row],[ ]]<>\"\",'ANEXO INGRESOS'!K26*'ANEXO INGRESOS'!$F26,\"\")","v":""},{"$f":"IF(Ingresos[[#This Row],[ ]]<>\"\",'ANEXO INGRESOS'!L26*'ANEXO INGRESOS'!$F26,\"\")","v":""},{"$f":"IF(Ingresos[[#This Row],[ ]]<>\"\",'ANEXO INGRESOS'!M26*'ANEXO INGRESOS'!$F26,\"\")","v":""},{"$f":"IF(Ingresos[[#This Row],[ ]]<>\"\",'ANEXO INGRESOS'!N26*'ANEXO INGRESOS'!$F26,\"\")","v":""},{"$f":"IF(Ingresos[[#This Row],[ ]]<>\"\",'ANEXO INGRESOS'!O26*'ANEXO INGRESOS'!$F26,\"\")","v":""},{"$f":"IF(Ingresos[[#This Row],[ ]]<>\"\",'ANEXO INGRESOS'!P26*'ANEXO INGRESOS'!$F26,\"\")","v":""},{"$f":"IF(Ingresos[[#This Row],[ ]]<>\"\",'ANEXO INGRESOS'!Q26*'ANEXO INGRESOS'!$F26,\"\")","v":""},{"$f":"IF(Ingresos[[#This Row],[ ]]<>\"\",'ANEXO INGRESOS'!R26*'ANEXO INGRESOS'!$F26,\"\")","v":""},{"$f":"IF(Ingresos[[#This Row],[ ]]<>\"\",'ANEXO INGRESOS'!S26*'ANEXO INGRESOS'!$F26,\"\")","v":""},{"$f":"IF(Ingresos[[#This Row],[ ]]=\"\",\"\",SUM(D34:O34))","v":""}]
[null,{"$f":"IF('ANEXO INGRESOS'!D27=\"\",\"\",'ANEXO INGRESOS'!C27)","v":""},{"$f":"IF('ANEXO INGRESOS'!D27=\"\",\"\",'ANEXO INGRESOS'!D27)","v":""},{"$f":"IF(Ingresos[[#This Row],[ ]]<>\"\",'ANEXO INGRESOS'!H27*'ANEXO INGRESOS'!$F27,\"\")","v":""},{"$f":"IF(Ingresos[[#This Row],[ ]]<>\"\",'ANEXO INGRESOS'!I27*'ANEXO INGRESOS'!$F27,\"\")","v":""},{"$f":"IF(Ingresos[[#This Row],[ ]]<>\"\",'ANEXO INGRESOS'!J27*'ANEXO INGRESOS'!$F27,\"\")","v":""},{"$f":"IF(Ingresos[[#This Row],[ ]]<>\"\",'ANEXO INGRESOS'!K27*'ANEXO INGRESOS'!$F27,\"\")","v":""},{"$f":"IF(Ingresos[[#This Row],[ ]]<>\"\",'ANEXO INGRESOS'!L27*'ANEXO INGRESOS'!$F27,\"\")","v":""},{"$f":"IF(Ingresos[[#This Row],[ ]]<>\"\",'ANEXO INGRESOS'!M27*'ANEXO INGRESOS'!$F27,\"\")","v":""},{"$f":"IF(Ingresos[[#This Row],[ ]]<>\"\",'ANEXO INGRESOS'!N27*'ANEXO INGRESOS'!$F27,\"\")","v":""},{"$f":"IF(Ingresos[[#This Row],[ ]]<>\"\",'ANEXO INGRESOS'!O27*'ANEXO INGRESOS'!$F27,\"\")","v":""},{"$f":"IF(Ingresos[[#This Row],[ ]]<>\"\",'ANEXO INGRESOS'!P27*'ANEXO INGRESOS'!$F27,\"\")","v":""},{"$f":"IF(Ingresos[[#This Row],[ ]]<>\"\",'ANEXO INGRESOS'!Q27*'ANEXO INGRESOS'!$F27,\"\")","v":""},{"$f":"IF(Ingresos[[#This Row],[ ]]<>\"\",'ANEXO INGRESOS'!R27*'ANEXO INGRESOS'!$F27,\"\")","v":""},{"$f":"IF(Ingresos[[#This Row],[ ]]<>\"\",'ANEXO INGRESOS'!S27*'ANEXO INGRESOS'!$F27,\"\")","v":""},{"$f":"IF(Ingresos[[#This Row],[ ]]=\"\",\"\",SUM(D35:O35))","v":""}]
[null,{"$f":"IF('ANEXO INGRESOS'!D28=\"\",\"\",'ANEXO INGRESOS'!C28)","v":""},{"$f":"IF('ANEXO INGRESOS'!D28=\"\",\"\",'ANEXO INGRESOS'!D28)","v":""},{"$f":"IF(Ingresos[[#This Row],[ ]]<>\"\",'ANEXO INGRESOS'!H28*'ANEXO INGRESOS'!$F28,\"\")","v":""},{"$f":"IF(Ingresos[[#This Row],[ ]]<>\"\",'ANEXO INGRESOS'!I28*'ANEXO INGRESOS'!$F28,\"\")","v":""},{"$f":"IF(Ingresos[[#This Row],[ ]]<>\"\",'ANEXO INGRESOS'!J28*'ANEXO INGRESOS'!$F28,\"\")","v":""},{"$f":"IF(Ingresos[[#This Row],[ ]]<>\"\",'ANEXO INGRESOS'!K28*'ANEXO INGRESOS'!$F28,\"\")","v":""},{"$f":"IF(Ingresos[[#This Row],[ ]]<>\"\",'ANEXO INGRESOS'!L28*'ANEXO INGRESOS'!$F28,\"\")","v":""},{"$f":"IF(Ingresos[[#This Row],[ ]]<>\"\",'ANEXO INGRESOS'!M28*'ANEXO INGRESOS'!$F28,\"\")","v":""},{"$f":"IF(Ingresos[[#This Row],[ ]]<>\"\",'ANEXO INGRESOS'!N28*'ANEXO INGRESOS'!$F28,\"\")","v":""},{"$f":"IF(Ingresos[[#This Row],[ ]]<>\"\",'ANEXO INGRESOS'!O28*'ANEXO INGRESOS'!$F28,\"\")","v":""},{"$f":"IF(Ingresos[[#This Row],[ ]]<>\"\",'ANEXO INGRESOS'!P28*'ANEXO INGRESOS'!$F28,\"\")","v":""},{"$f":"IF(Ingresos[[#This Row],[ ]]<>\"\",'ANEXO INGRESOS'!Q28*'ANEXO INGRESOS'!$F28,\"\")","v":""},{"$f":"IF(Ingresos[[#This Row],[ ]]<>\"\",'ANEXO INGRESOS'!R28*'ANEXO INGRESOS'!$F28,\"\")","v":""},{"$f":"IF(Ingresos[[#This Row],[ ]]<>\"\",'ANEXO INGRESOS'!S28*'ANEXO INGRESOS'!$F28,\"\")","v":""},{"$f":"IF(Ingresos[[#This Row],[ ]]=\"\",\"\",SUM(D36:O36))","v":""}]
[null,{"$f":"IF('ANEXO INGRESOS'!D29=\"\",\"\",'ANEXO INGRESOS'!C29)","v":""},{"$f":"IF('ANEXO INGRESOS'!D29=\"\",\"\",'ANEXO INGRESOS'!D29)","v":""},{"$f":"IF(Ingresos[[#This Row],[ ]]<>\"\",'ANEXO INGRESOS'!H29*'ANEXO INGRESOS'!$F29,\"\")","v":""},{"$f":"IF(Ingresos[[#This Row],[ ]]<>\"\",'ANEXO INGRESOS'!I29*'ANEXO INGRESOS'!$F29,\"\")","v":""},{"$f":"IF(Ingresos[[#This Row],[ ]]<>\"\",'ANEXO INGRESOS'!J29*'ANEXO INGRESOS'!$F29,\"\")","v":""},{"$f":"IF(Ingresos[[#This Row],[ ]]<>\"\",'ANEXO INGRESOS'!K29*'ANEXO INGRESOS'!$F29,\"\")","v":""},{"$f":"IF(Ingresos[[#This Row],[ ]]<>\"\",'ANEXO INGRESOS'!L29*'ANEXO INGRESOS'!$F29,\"\")","v":""},{"$f":"IF(Ingresos[[#This Row],[ ]]<>\"\",'ANEXO INGRESOS'!M29*'ANEXO INGRESOS'!$F29,\"\")","v":""},{"$f":"IF(Ingresos[[#This Row],[ ]]<>\"\",'ANEXO INGRESOS'!N29*'ANEXO INGRESOS'!$F29,\"\")","v":""},{"$f":"IF(Ingresos[[#This Row],[ ]]<>\"\",'ANEXO INGRESOS'!O29*'ANEXO INGRESOS'!$F29,\"\")","v":""},{"$f":"IF(Ingresos[[#This Row],[ ]]<>\"\",'ANEXO INGRESOS'!P29*'ANEXO INGRESOS'!$F29,\"\")","v":""},{"$f":"IF(Ingresos[[#This Row],[ ]]<>\"\",'ANEXO INGRESOS'!Q29*'ANEXO INGRESOS'!$F29,\"\")","v":""},{"$f":"IF(Ingresos[[#This Row],[ ]]<>\"\",'ANEXO INGRESOS'!R29*'ANEXO INGRESOS'!$F29,\"\")","v":""},{"$f":"IF(Ingresos[[#This Row],[ ]]<>\"\",'ANEXO INGRESOS'!S29*'ANEXO INGRESOS'!$F29,\"\")","v":""},{"$f":"IF(Ingresos[[#This Row],[ ]]=\"\",\"\",SUM(D37:O37))","v":""}]
[null,{"$f":"IF('ANEXO INGRESOS'!D30=\"\",\"\",'ANEXO INGRESOS'!C30)","v":""},{"$f":"IF('ANEXO INGRESOS'!D30=\"\",\"\",'ANEXO INGRESOS'!D30)","v":""},{"$f":"IF(Ingresos[[#This Row],[ ]]<>\"\",'ANEXO INGRESOS'!H30*'ANEXO INGRESOS'!$F30,\"\")","v":""},{"$f":"IF(Ingresos[[#This Row],[ ]]<>\"\",'ANEXO INGRESOS'!I30*'ANEXO INGRESOS'!$F30,\"\")","v":""},{"$f":"IF(Ingresos[[#This Row],[ ]]<>\"\",'ANEXO INGRESOS'!J30*'ANEXO INGRESOS'!$F30,\"\")","v":""},{"$f":"IF(Ingresos[[#This Row],[ ]]<>\"\",'ANEXO INGRESOS'!K30*'ANEXO INGRESOS'!$F30,\"\")","v":""},{"$f":"IF(Ingresos[[#This Row],[ ]]<>\"\",'ANEXO INGRESOS'!L30*'ANEXO INGRESOS'!$F30,\"\")","v":""},{"$f":"IF(Ingresos[[#This Row],[ ]]<>\"\",'ANEXO INGRESOS'!M30*'ANEXO INGRESOS'!$F30,\"\")","v":""},{"$f":"IF(Ingresos[[#This Row],[ ]]<>\"\",'ANEXO INGRESOS'!N30*'ANEXO INGRESOS'!$F30,\"\")","v":""},{"$f":"IF(Ingresos[[#This Row],[ ]]<>\"\",'ANEXO INGRESOS'!O30*'ANEXO INGRESOS'!$F30,\"\")","v":""},{"$f":"IF(Ingresos[[#This Row],[ ]]<>\"\",'ANEXO INGRESOS'!P30*'ANEXO INGRESOS'!$F30,\"\")","v":""},{"$f":"IF(Ingresos[[#This Row],[ ]]<>\"\",'ANEXO INGRESOS'!Q30*'ANEXO INGRESOS'!$F30,\"\")","v":""},{"$f":"IF(Ingresos[[#This Row],[ ]]<>\"\",'ANEXO INGRESOS'!R30*'ANEXO INGRESOS'!$F30,\"\")","v":""},{"$f":"IF(Ingresos[[#This Row],[ ]]<>\"\",'ANEXO INGRESOS'!S30*'ANEXO INGRESOS'!$F30,\"\")","v":""},{"$f":"IF(Ingresos[[#This Row],[ ]]=\"\",\"\",SUM(D38:O38))","v":""}]
[null,{"$f":"IF('ANEXO INGRESOS'!D33=\"\",\"\",'ANEXO INGRESOS'!C33)","v":""},{"$f":"IF('ANEXO INGRESOS'!D31=\"\",\"\",'ANEXO INGRESOS'!D31)","v":""},{"$f":"IF(Ingresos[[#This Row],[ ]]<>\"\",'ANEXO INGRESOS'!H31*'ANEXO INGRESOS'!$F31,\"\")","v":""},{"$f":"IF(Ingresos[[#This Row],[ ]]<>\"\",'ANEXO INGRESOS'!I31*'ANEXO INGRESOS'!$F31,\"\")","v":""},{"$f":"IF(Ingresos[[#This Row],[ ]]<>\"\",'ANEXO INGRESOS'!J31*'ANEXO INGRESOS'!$F31,\"\")","v":""},{"$f":"IF(Ingresos[[#This Row],[ ]]<>\"\",'ANEXO INGRESOS'!K31*'ANEXO INGRESOS'!$F31,\"\")","v":""},{"$f":"IF(Ingresos[[#This Row],[ ]]<>\"\",'ANEXO INGRESOS'!L31*'ANEXO INGRESOS'!$F31,\"\")","v":""},{"$f":"IF(Ingresos[[#This Row],[ ]]<>\"\",'ANEXO INGRESOS'!M31*'ANEXO INGRESOS'!$F31,\"\")","v":""},{"$f":"IF(Ingresos[[#This Row],[ ]]<>\"\",'ANEXO INGRESOS'!N31*'ANEXO INGRESOS'!$F31,\"\")","v":""},{"$f":"IF(Ingresos[[#This Row],[ ]]<>\"\",'ANEXO INGRESOS'!O31*'ANEXO INGRESOS'!$F31,\"\")","v":""},{"$f":"IF(Ingresos[[#This Row],[ ]]<>\"\",'ANEXO INGRESOS'!P31*'ANEXO INGRESOS'!$F31,\"\")","v":""},{"$f":"IF(Ingresos[[#This Row],[ ]]<>\"\",'ANEXO INGRESOS'!Q31*'ANEXO INGRESOS'!$F31,\"\")","v":""},{"$f":"IF(Ingresos[[#This Row],[ ]]<>\"\",'ANEXO INGRESOS'!R31*'ANEXO INGRESOS'!$F31,\"\")","v":""},{"$f":"IF(Ingresos[[#This Row],[ ]]<>\"\",'ANEXO INGRESOS'!S31*'ANEXO INGRESOS'!$F31,\"\")","v":""},{"$f":"IF(Ingresos[[#This Row],[ ]]=\"\",\"\",SUM(D39:O39))","v":""}]
[null,{"$f":"IF('ANEXO INGRESOS'!D34=\"\",\"\",'ANEXO INGRESOS'!C34)","v":""},{"$f":"IF('ANEXO INGRESOS'!D32=\"\",\"\",'ANEXO INGRESOS'!D32)","v":""},{"$f":"IF(Ingresos[[#This Row],[ ]]<>\"\",'ANEXO INGRESOS'!H32*'ANEXO INGRESOS'!$F32,\"\")","v":""},{"$f":"IF(Ingresos[[#This Row],[ ]]<>\"\",'ANEXO INGRESOS'!I32*'ANEXO INGRESOS'!$F32,\"\")","v":""},{"$f":"IF(Ingresos[[#This Row],[ ]]<>\"\",'ANEXO INGRESOS'!J32*'ANEXO INGRESOS'!$F32,\"\")","v":""},{"$f":"IF(Ingresos[[#This Row],[ ]]<>\"\",'ANEXO INGRESOS'!K32*'ANEXO INGRESOS'!$F32,\"\")","v":""},{"$f":"IF(Ingresos[[#This Row],[ ]]<>\"\",'ANEXO INGRESOS'!L32*'ANEXO INGRESOS'!$F32,\"\")","v":""},{"$f":"IF(Ingresos[[#This Row],[ ]]<>\"\",'ANEXO INGRESOS'!M32*'ANEXO INGRESOS'!$F32,\"\")","v":""},{"$f":"IF(Ingresos[[#This Row],[ ]]<>\"\",'ANEXO INGRESOS'!N32*'ANEXO INGRESOS'!$F32,\"\")","v":""},{"$f":"IF(Ingresos[[#This Row],[ ]]<>\"\",'ANEXO INGRESOS'!O32*'ANEXO INGRESOS'!$F32,\"\")","v":""},{"$f":"IF(Ingresos[[#This Row],[ ]]<>\"\",'ANEXO INGRESOS'!P32*'ANEXO INGRESOS'!$F32,\"\")","v":""},{"$f":"IF(Ingresos[[#This Row],[ ]]<>\"\",'ANEXO INGRESOS'!Q32*'ANEXO INGRESOS'!$F32,\"\")","v":""},{"$f":"IF(Ingresos[[#This Row],[ ]]<>\"\",'ANEXO INGRESOS'!R32*'ANEXO INGRESOS'!$F32,\"\")","v":""},{"$f":"IF(Ingresos[[#This Row],[ ]]<>\"\",'ANEXO INGRESOS'!S32*'ANEXO INGRESOS'!$F32,\"\")","v":""},{"$f":"IF(Ingresos[[#This Row],[ ]]=\"\",\"\",SUM(D40:O40))","v":""}]
[null,{"$f":"IF('ANEXO INGRESOS'!D41=\"\",\"\",'ANEXO INGRESOS'!C41)","v":""},{"$f":"IF('ANEXO INGRESOS'!D33=\"\",\"\",'ANEXO INGRESOS'!D33)","v":""},{"$f":"IF(Ingresos[[#This Row],[ ]]<>\"\",'ANEXO INGRESOS'!H33*'ANEXO INGRESOS'!$F33,\"\")","v":""},{"$f":"IF(Ingresos[[#This Row],[ ]]<>\"\",'ANEXO INGRESOS'!I33*'ANEXO INGRESOS'!$F33,\"\")","v":""},{"$f":"IF(Ingresos[[#This Row],[ ]]<>\"\",'ANEXO INGRESOS'!J33*'ANEXO INGRESOS'!$F33,\"\")","v":""},{"$f":"IF(Ingresos[[#This Row],[ ]]<>\"\",'ANEXO INGRESOS'!K33*'ANEXO INGRESOS'!$F33,\"\")","v":""},{"$f":"IF(Ingresos[[#This Row],[ ]]<>\"\",'ANEXO INGRESOS'!L33*'ANEXO INGRESOS'!$F33,\"\")","v":""},{"$f":"IF(Ingresos[[#This Row],[ ]]<>\"\",'ANEXO INGRESOS'!M33*'ANEXO INGRESOS'!$F33,\"\")","v":""},{"$f":"IF(Ingresos[[#This Row],[ ]]<>\"\",'ANEXO INGRESOS'!N33*'ANEXO INGRESOS'!$F33,\"\")","v":""},{"$f":"IF(Ingresos[[#This Row],[ ]]<>\"\",'ANEXO INGRESOS'!O33*'ANEXO INGRESOS'!$F33,\"\")","v":""},{"$f":"IF(Ingresos[[#This Row],[ ]]<>\"\",'ANEXO INGRESOS'!P33*'ANEXO INGRESOS'!$F33,\"\")","v":""},{"$f":"IF(Ingresos[[#This Row],[ ]]<>\"\",'ANEXO INGRESOS'!Q33*'ANEXO INGRESOS'!$F33,\"\")","v":""},{"$f":"IF(Ingresos[[#This Row],[ ]]<>\"\",'ANEXO INGRESOS'!R33*'ANEXO INGRESOS'!$F33,\"\")","v":""},{"$f":"IF(Ingresos[[#This Row],[ ]]<>\"\",'ANEXO INGRESOS'!S33*'ANEXO INGRESOS'!$F33,\"\")","v":""},{"$f":"IF(Ingresos[[#This Row],[ ]]=\"\",\"\",SUM(D41:O41))","v":""}]
[null,{"$f":"IF('ANEXO INGRESOS'!D42=\"\",\"\",'ANEXO INGRESOS'!C42)","v":""},{"$f":"IF('ANEXO INGRESOS'!D34=\"\",\"\",'ANEXO INGRESOS'!D34)","v":""},{"$f":"IF(Ingresos[[#This Row],[ ]]<>\"\",'ANEXO INGRESOS'!H34*'ANEXO INGRESOS'!$F34,\"\")","v":""},{"$f":"IF(Ingresos[[#This Row],[ ]]<>\"\",'ANEXO INGRESOS'!I34*'ANEXO INGRESOS'!$F34,\"\")","v":""},{"$f":"IF(Ingresos[[#This Row],[ ]]<>\"\",'ANEXO INGRESOS'!J34*'ANEXO INGRESOS'!$F34,\"\")","v":""},{"$f":"IF(Ingresos[[#This Row],[ ]]<>\"\",'ANEXO INGRESOS'!K34*'ANEXO INGRESOS'!$F34,\"\")","v":""},{"$f":"IF(Ingresos[[#This Row],[ ]]<>\"\",'ANEXO INGRESOS'!L34*'ANEXO INGRESOS'!$F34,\"\")","v":""},{"$f":"IF(Ingresos[[#This Row],[ ]]<>\"\",'ANEXO INGRESOS'!M34*'ANEXO INGRESOS'!$F34,\"\")","v":""},{"$f":"IF(Ingresos[[#This Row],[ ]]<>\"\",'ANEXO INGRESOS'!N34*'ANEXO INGRESOS'!$F34,\"\")","v":""},{"$f":"IF(Ingresos[[#This Row],[ ]]<>\"\",'ANEXO INGRESOS'!O34*'ANEXO INGRESOS'!$F34,\"\")","v":""},{"$f":"IF(Ingresos[[#This Row],[ ]]<>\"\",'ANEXO INGRESOS'!P34*'ANEXO INGRESOS'!$F34,\"\")","v":""},{"$f":"IF(Ingresos[[#This Row],[ ]]<>\"\",'ANEXO INGRESOS'!Q34*'ANEXO INGRESOS'!$F34,\"\")","v":""},{"$f":"IF(Ingresos[[#This Row],[ ]]<>\"\",'ANEXO INGRESOS'!R34*'ANEXO INGRESOS'!$F34,\"\")","v":""},{"$f":"IF(Ingresos[[#This Row],[ ]]<>\"\",'ANEXO INGRESOS'!S34*'ANEXO INGRESOS'!$F34,\"\")","v":""},{"$f":"IF(Ingresos[[#This Row],[ ]]=\"\",\"\",SUM(D42:O42))","v":""}]
[null,{"$f":"IF('ANEXO INGRESOS'!D43=\"\",\"\",'ANEXO INGRESOS'!C43)","v":""},{"$f":"IF('ANEXO INGRESOS'!D35=\"\",\"\",'ANEXO INGRESOS'!D35)","v":""},{"$f":"IF(Ingresos[[#This Row],[ ]]<>\"\",'ANEXO INGRESOS'!H35*'ANEXO INGRESOS'!$F35,\"\")","v":""},{"$f":"IF(Ingresos[[#This Row],[ ]]<>\"\",'ANEXO INGRESOS'!I35*'ANEXO INGRESOS'!$F35,\"\")","v":""},{"$f":"IF(Ingresos[[#This Row],[ ]]<>\"\",'ANEXO INGRESOS'!J35*'ANEXO INGRESOS'!$F35,\"\")","v":""},{"$f":"IF(Ingresos[[#This Row],[ ]]<>\"\",'ANEXO INGRESOS'!K35*'ANEXO INGRESOS'!$F35,\"\")","v":""},{"$f":"IF(Ingresos[[#This Row],[ ]]<>\"\",'ANEXO INGRESOS'!L35*'ANEXO INGRESOS'!$F35,\"\")","v":""},{"$f":"IF(Ingresos[[#This Row],[ ]]<>\"\",'ANEXO INGRESOS'!M35*'ANEXO INGRESOS'!$F35,\"\")","v":""},{"$f":"IF(Ingresos[[#This Row],[ ]]<>\"\",'ANEXO INGRESOS'!N35*'ANEXO INGRESOS'!$F35,\"\")","v":""},{"$f":"IF(Ingresos[[#This Row],[ ]]<>\"\",'ANEXO INGRESOS'!O35*'ANEXO INGRESOS'!$F35,\"\")","v":""},{"$f":"IF(Ingresos[[#This Row],[ ]]<>\"\",'ANEXO INGRESOS'!P35*'ANEXO INGRESOS'!$F35,\"\")","v":""},{"$f":"IF(Ingresos[[#This Row],[ ]]<>\"\",'ANEXO INGRESOS'!Q35*'ANEXO INGRESOS'!$F35,\"\")","v":""},{"$f":"IF(Ingresos[[#This Row],[ ]]<>\"\",'ANEXO INGRESOS'!R35*'ANEXO INGRESOS'!$F35,\"\")","v":""},{"$f":"IF(Ingresos[[#This Row],[ ]]<>\"\",'ANEXO INGRESOS'!S35*'ANEXO INGRESOS'!$F35,\"\")","v":""},{"$f":"IF(Ingresos[[#This Row],[ ]]=\"\",\"\",SUM(D43:O43))","v":""}]
[null,{"$f":"IF('ANEXO INGRESOS'!D44=\"\",\"\",'ANEXO INGRESOS'!C44)","v":""},{"$f":"IF('ANEXO INGRESOS'!D36=\"\",\"\",'ANEXO INGRESOS'!D36)","v":""},{"$f":"IF(Ingresos[[#This Row],[ ]]<>\"\",'ANEXO INGRESOS'!H36*'ANEXO INGRESOS'!$F36,\"\")","v":""},{"$f":"IF(Ingresos[[#This Row],[ ]]<>\"\",'ANEXO INGRESOS'!I36*'ANEXO INGRESOS'!$F36,\"\")","v":""},{"$f":"IF(Ingresos[[#This Row],[ ]]<>\"\",'ANEXO INGRESOS'!J36*'ANEXO INGRESOS'!$F36,\"\")","v":""},{"$f":"IF(Ingresos[[#This Row],[ ]]<>\"\",'ANEXO INGRESOS'!K36*'ANEXO INGRESOS'!$F36,\"\")","v":""},{"$f":"IF(Ingresos[[#This Row],[ ]]<>\"\",'ANEXO INGRESOS'!L36*'ANEXO INGRESOS'!$F36,\"\")","v":""},{"$f":"IF(Ingresos[[#This Row],[ ]]<>\"\",'ANEXO INGRESOS'!M36*'ANEXO INGRESOS'!$F36,\"\")","v":""},{"$f":"IF(Ingresos[[#This Row],[ ]]<>\"\",'ANEXO INGRESOS'!N36*'ANEXO INGRESOS'!$F36,\"\")","v":""},{"$f":"IF(Ingresos[[#This Row],[ ]]<>\"\",'ANEXO INGRESOS'!O36*'ANEXO INGRESOS'!$F36,\"\")","v":""},{"$f":"IF(Ingresos[[#This Row],[ ]]<>\"\",'ANEXO INGRESOS'!P36*'ANEXO INGRESOS'!$F36,\"\")","v":""},{"$f":"IF(Ingresos[[#This Row],[ ]]<>\"\",'ANEXO INGRESOS'!Q36*'ANEXO INGRESOS'!$F36,\"\")","v":""},{"$f":"IF(Ingresos[[#This Row],[ ]]<>\"\",'ANEXO INGRESOS'!R36*'ANEXO INGRESOS'!$F36,\"\")","v":""},{"$f":"IF(Ingresos[[#This Row],[ ]]<>\"\",'ANEXO INGRESOS'!S36*'ANEXO INGRESOS'!$F36,\"\")","v":""},{"$f":"IF(Ingresos[[#This Row],[ ]]=\"\",\"\",SUM(D44:O44))","v":""}]
[null,{"$f":"IF('ANEXO INGRESOS'!D45=\"\",\"\",'ANEXO INGRESOS'!C45)","v":""},{"$f":"IF('ANEXO INGRESOS'!D37=\"\",\"\",'ANEXO INGRESOS'!D37)","v":""},{"$f":"IF(Ingresos[[#This Row],[ ]]<>\"\",'ANEXO INGRESOS'!H37*'ANEXO INGRESOS'!$F37,\"\")","v":""},{"$f":"IF(Ingresos[[#This Row],[ ]]<>\"\",'ANEXO INGRESOS'!I37*'ANEXO INGRESOS'!$F37,\"\")","v":""},{"$f":"IF(Ingresos[[#This Row],[ ]]<>\"\",'ANEXO INGRESOS'!J37*'ANEXO INGRESOS'!$F37,\"\")","v":""},{"$f":"IF(Ingresos[[#This Row],[ ]]<>\"\",'ANEXO INGRESOS'!K37*'ANEXO INGRESOS'!$F37,\"\")","v":""},{"$f":"IF(Ingresos[[#This Row],[ ]]<>\"\",'ANEXO INGRESOS'!L37*'ANEXO INGRESOS'!$F37,\"\")","v":""},{"$f":"IF(Ingresos[[#This Row],[ ]]<>\"\",'ANEXO INGRESOS'!M37*'ANEXO INGRESOS'!$F37,\"\")","v":""},{"$f":"IF(Ingresos[[#This Row],[ ]]<>\"\",'ANEXO INGRESOS'!N37*'ANEXO INGRESOS'!$F37,\"\")","v":""},{"$f":"IF(Ingresos[[#This Row],[ ]]<>\"\",'ANEXO INGRESOS'!O37*'ANEXO INGRESOS'!$F37,\"\")","v":""},{"$f":"IF(Ingresos[[#This Row],[ ]]<>\"\",'ANEXO INGRESOS'!P37*'ANEXO INGRESOS'!$F37,\"\")","v":""},{"$f":"IF(Ingresos[[#This Row],[ ]]<>\"\",'ANEXO INGRESOS'!Q37*'ANEXO INGRESOS'!$F37,\"\")","v":""},{"$f":"IF(Ingresos[[#This Row],[ ]]<>\"\",'ANEXO INGRESOS'!R37*'ANEXO INGRESOS'!$F37,\"\")","v":""},{"$f":"IF(Ingresos[[#This Row],[ ]]<>\"\",'ANEXO INGRESOS'!S37*'ANEXO INGRESOS'!$F37,\"\")","v":""},{"$f":"IF(Ingresos[[#This Row],[ ]]=\"\",\"\",SUM(D45:O45))","v":""}]
[null,{"$f":"IF('ANEXO INGRESOS'!D46=\"\",\"\",'ANEXO INGRESOS'!C46)","v":""},{"$f":"IF('ANEXO INGRESOS'!D38=\"\",\"\",'ANEXO INGRESOS'!D38)","v":""},{"$f":"IF(Ingresos[[#This Row],[ ]]<>\"\",'ANEXO INGRESOS'!H38*'ANEXO INGRESOS'!$F38,\"\")","v":""},{"$f":"IF(Ingresos[[#This Row],[ ]]<>\"\",'ANEXO INGRESOS'!I38*'ANEXO INGRESOS'!$F38,\"\")","v":""},{"$f":"IF(Ingresos[[#This Row],[ ]]<>\"\",'ANEXO INGRESOS'!J38*'ANEXO INGRESOS'!$F38,\"\")","v":""},{"$f":"IF(Ingresos[[#This Row],[ ]]<>\"\",'ANEXO INGRESOS'!K38*'ANEXO INGRESOS'!$F38,\"\")","v":""},{"$f":"IF(Ingresos[[#This Row],[ ]]<>\"\",'ANEXO INGRESOS'!L38*'ANEXO INGRESOS'!$F38,\"\")","v":""},{"$f":"IF(Ingresos[[#This Row],[ ]]<>\"\",'ANEXO INGRESOS'!M38*'ANEXO INGRESOS'!$F38,\"\")","v":""},{"$f":"IF(Ingresos[[#This Row],[ ]]<>\"\",'ANEXO INGRESOS'!N38*'ANEXO INGRESOS'!$F38,\"\")","v":""},{"$f":"IF(Ingresos[[#This Row],[ ]]<>\"\",'ANEXO INGRESOS'!O38*'ANEXO INGRESOS'!$F38,\"\")","v":""},{"$f":"IF(Ingresos[[#This Row],[ ]]<>\"\",'ANEXO INGRESOS'!P38*'ANEXO INGRESOS'!$F38,\"\")","v":""},{"$f":"IF(Ingresos[[#This Row],[ ]]<>\"\",'ANEXO INGRESOS'!Q38*'ANEXO INGRESOS'!$F38,\"\")","v":""},{"$f":"IF(Ingresos[[#This Row],[ ]]<>\"\",'ANEXO INGRESOS'!R38*'ANEXO INGRESOS'!$F38,\"\")","v":""},{"$f":"IF(Ingresos[[#This Row],[ ]]<>\"\",'ANEXO INGRESOS'!S38*'ANEXO INGRESOS'!$F38,\"\")","v":""},{"$f":"IF(Ingresos[[#This Row],[ ]]=\"\",\"\",SUM(D46:O46))","v":""}]
[null,{"$f":"IF('ANEXO INGRESOS'!D47=\"\",\"\",'ANEXO INGRESOS'!C47)","v":""},{"$f":"IF('ANEXO INGRESOS'!D39=\"\",\"\",'ANEXO INGRESOS'!D39)","v":""},{"$f":"IF(Ingresos[[#This Row],[ ]]<>\"\",'ANEXO INGRESOS'!H39*'ANEXO INGRESOS'!$F39,\"\")","v":""},{"$f":"IF(Ingresos[[#This Row],[ ]]<>\"\",'ANEXO INGRESOS'!I39*'ANEXO INGRESOS'!$F39,\"\")","v":""},{"$f":"IF(Ingresos[[#This Row],[ ]]<>\"\",'ANEXO INGRESOS'!J39*'ANEXO INGRESOS'!$F39,\"\")","v":""},{"$f":"IF(Ingresos[[#This Row],[ ]]<>\"\",'ANEXO INGRESOS'!K39*'ANEXO INGRESOS'!$F39,\"\")","v":""},{"$f":"IF(Ingresos[[#This Row],[ ]]<>\"\",'ANEXO INGRESOS'!L39*'ANEXO INGRESOS'!$F39,\"\")","v":""},{"$f":"IF(Ingresos[[#This Row],[ ]]<>\"\",'ANEXO INGRESOS'!M39*'ANEXO INGRESOS'!$F39,\"\")","v":""},{"$f":"IF(Ingresos[[#This Row],[ ]]<>\"\",'ANEXO INGRESOS'!N39*'ANEXO INGRESOS'!$F39,\"\")","v":""},{"$f":"IF(Ingresos[[#This Row],[ ]]<>\"\",'ANEXO INGRESOS'!O39*'ANEXO INGRESOS'!$F39,\"\")","v":""},{"$f":"IF(Ingresos[[#This Row],[ ]]<>\"\",'ANEXO INGRESOS'!P39*'ANEXO INGRESOS'!$F39,\"\")","v":""},{"$f":"IF(Ingresos[[#This Row],[ ]]<>\"\",'ANEXO INGRESOS'!Q39*'ANEXO INGRESOS'!$F39,\"\")","v":""},{"$f":"IF(Ingresos[[#This Row],[ ]]<>\"\",'ANEXO INGRESOS'!R39*'ANEXO INGRESOS'!$F39,\"\")","v":""},{"$f":"IF(Ingresos[[#This Row],[ ]]<>\"\",'ANEXO INGRESOS'!S39*'ANEXO INGRESOS'!$F39,\"\")","v":""},{"$f":"IF(Ingresos[[#This Row],[ ]]=\"\",\"\",SUM(D47:O47))","v":""}]
[null,{"$f":"IF('ANEXO INGRESOS'!C41=\"\",\"\",'ANEXO INGRESOS'!C41)","v":""},{"$f":"IF('ANEXO INGRESOS'!D40=\"\",\"\",'ANEXO INGRESOS'!D40)","v":""},{"$f":"IF(Ingresos[[#This Row],[ ]]<>\"\",'ANEXO INGRESOS'!H40*'ANEXO INGRESOS'!$F40,\"\")","v":""},{"$f":"IF(Ingresos[[#This Row],[ ]]<>\"\",'ANEXO INGRESOS'!I40*'ANEXO INGRESOS'!$F40,\"\")","v":""},{"$f":"IF(Ingresos[[#This Row],[ ]]<>\"\",'ANEXO INGRESOS'!J40*'ANEXO INGRESOS'!$F40,\"\")","v":""},{"$f":"IF(Ingresos[[#This Row],[ ]]<>\"\",'ANEXO INGRESOS'!K40*'ANEXO INGRESOS'!$F40,\"\")","v":""},{"$f":"IF(Ingresos[[#This Row],[ ]]<>\"\",'ANEXO INGRESOS'!L40*'ANEXO INGRESOS'!$F40,\"\")","v":""},{"$f":"IF(Ingresos[[#This Row],[ ]]<>\"\",'ANEXO INGRESOS'!M40*'ANEXO INGRESOS'!$F40,\"\")","v":""},{"$f":"IF(Ingresos[[#This Row],[ ]]<>\"\",'ANEXO INGRESOS'!N40*'ANEXO INGRESOS'!$F40,\"\")","v":""},{"$f":"IF(Ingresos[[#This Row],[ ]]<>\"\",'ANEXO INGRESOS'!O40*'ANEXO INGRESOS'!$F40,\"\")","v":""},{"$f":"IF(Ingresos[[#This Row],[ ]]<>\"\",'ANEXO INGRESOS'!P40*'ANEXO INGRESOS'!$F40,\"\")","v":""},{"$f":"IF(Ingresos[[#This Row],[ ]]<>\"\",'ANEXO INGRESOS'!Q40*'ANEXO INGRESOS'!$F40,\"\")","v":""},{"$f":"IF(Ingresos[[#This Row],[ ]]<>\"\",'ANEXO INGRESOS'!R40*'ANEXO INGRESOS'!$F40,\"\")","v":""},{"$f":"IF(Ingresos[[#This Row],[ ]]<>\"\",'ANEXO INGRESOS'!S40*'ANEXO INGRESOS'!$F40,\"\")","v":""},{"$f":"IF(Ingresos[[#This Row],[ ]]=\"\",\"\",SUM(D48:O48))","v":""}]
[null,null,"TOTAL INGRESOS ",{"$f":"SUM('4.INGRESOS'!$D$21:$D$48)","v":0},{"$f":"SUM('4.INGRESOS'!$E$21:$E$48)","v":0},{"$f":"SUM('4.INGRESOS'!$F$21:$F$48)","v":0},{"$f":"SUM('4.INGRESOS'!$G$21:$G$48)","v":0},{"$f":"SUM('4.INGRESOS'!$H$21:$H$48)","v":0},{"$f":"SUM('4.INGRESOS'!$I$21:$I$48)","v":0},{"$f":"SUM('4.INGRESOS'!$J$21:$J$48)","v":0},{"$f":"SUM('4.INGRESOS'!$K$21:$K$48)","v":0},{"$f":"SUM('4.INGRESOS'!$L$21:$L$48)","v":0},{"$f":"SUM('4.INGRESOS'!$M$21:$M$48)","v":0},{"$f":"SUM('4.INGRESOS'!$N$21:$N$48)","v":0},{"$f":"SUM('4.INGRESOS'!$O$21:$O$48)","v":0},{"$f":"SUM('4.INGRESOS'!$P$21:$P$48)","v":0}]
[]
[null,"Columna1","Columna2","Mes 1","Mes 2","Mes 3","Mes 4","Mes 5","Mes 6","Mes 7","Mes 8","Mes 9","Mes 10","Mes 11","Mes 12","Columna3"]
[null,"IVA %","Otros Ingresos",{"$f":"'7.CUENTA DE RESULTADOS '!C20","v":"1900enero"},{"$f":"'7.CUENTA DE RESULTADOS '!D20","v":"1900enero"},{"$f":"'7.CUENTA DE RESULTADOS '!E20","v":"1900febrero"},{"$f":"'7.CUENTA DE RESULTADOS '!F20","v":"1900marzo"},{"$f":"'7.CUENTA DE RESULTADOS '!G20","v":"1900abril"},{"$f":"'7.CUENTA DE RESULTADOS '!H20","v":"1900mayo"},{"$f":"'7.CUENTA DE RESULTADOS '!I20","v":"1900junio"},{"$f":"'7.CUENTA DE RESULTADOS '!J20","v":"1900julio"},{"$f":"'7.CUENTA DE RESULTADOS '!K20","v":"1900agosto"},{"$f":"'7.CUENTA DE RESULTADOS '!L20","v":"1900septiembre"},{"$f":"'7.CUENTA DE RESULTADOS '!M20","v":"1900octubre"},{"$f":"'7.CUENTA DE RESULTADOS '!N20","v":"1900noviembre"},{"$f":"+P21","v":"TOTAL"}]
[null,{"$f":"IF('ANEXO INGRESOS'!C51<>\"\",'ANEXO INGRESOS'!C51,\"\")","v":""},{"$f":"IF('ANEXO INGRESOS'!D51<>\"\",'ANEXO INGRESOS'!D51,\"\")","v":""},{"$f":"IF(Otros_ingresos_imprimir[[#This Row],[Columna2]]=\"\",\"\",'ANEXO INGRESOS'!H51*'ANEXO INGRESOS'!$F51)","v":""},{"$f":"IF(Otros_ingresos_imprimir[[#This Row],[Mes 1]]=\"\",\"\",'ANEXO INGRESOS'!I51*'ANEXO INGRESOS'!$F51)","v":""},{"$f":"IF(Otros_ingresos_imprimir[[#This Row],[Mes 2]]=\"\",\"\",'ANEXO INGRESOS'!J51*'ANEXO INGRESOS'!$F51)","v":""},{"$f":"IF(Otros_ingresos_imprimir[[#This Row],[Mes 3]]=\"\",\"\",'ANEXO INGRESOS'!K51*'ANEXO INGRESOS'!$F51)","v":""},{"$f":"IF(Otros_ingresos_imprimir[[#This Row],[Mes 4]]=\"\",\"\",'ANEXO INGRESOS'!L51*'ANEXO INGRESOS'!$F51)","v":""},{"$f":"IF(Otros_ingresos_imprimir[[#This Row],[Mes 5]]=\"\",\"\",'ANEXO INGRESOS'!M51*'ANEXO INGRESOS'!$F51)","v":""},{"$f":"IF(Otros_ingresos_imprimir[[#This Row],[Mes 6]]=\"\",\"\",'ANEXO INGRESOS'!N51*'ANEXO INGRESOS'!$F51)","v":""},{"$f":"IF(Otros_ingresos_imprimir[[#This Row],[Mes 7]]=\"\",\"\",'ANEXO INGRESOS'!O51*'ANEXO INGRESOS'!$F51)","v":""},{"$f":"IF(Otros_ingresos_imprimir[[#This Row],[Mes 8]]=\"\",\"\",'ANEXO INGRESOS'!P51*'ANEXO INGRESOS'!$F51)","v":""},{"$f":"IF(Otros_ingresos_imprimir[[#This Row],[Mes 9]]=\"\",\"\",'ANEXO INGRESOS'!Q51*'ANEXO INGRESOS'!$F51)","v":""},{"$f":"IF(Otros_ingresos_imprimir[[#This Row],[Mes 10]]=\"\",\"\",'ANEXO INGRESOS'!R51*'ANEXO INGRESOS'!$F51)","v":""},{"$f":"IF(Otros_ingresos_imprimir[[#This Row],[Mes 11]]=\"\",\"\",'ANEXO INGRESOS'!S51*'ANEXO INGRESOS'!$F51)","v":""},{"$f":"SUM(D53:O53)","v":0}]
[null,{"$f":"IF('ANEXO INGRESOS'!C52<>\"\",'ANEXO INGRESOS'!C52,\"\")","v":""},{"$f":"IF('ANEXO INGRESOS'!D52<>\"\",'ANEXO INGRESOS'!D52,\"\")","v":""},{"$f":"IF(Otros_ingresos_imprimir[[#This Row],[Columna2]]=\"\",\"\",'ANEXO INGRESOS'!H52*'ANEXO INGRESOS'!$F52)","v":""},{"$f":"IF(Otros_ingresos_imprimir[[#This Row],[Mes 1]]=\"\",\"\",'ANEXO INGRESOS'!I52*'ANEXO INGRESOS'!$F52)","v":""},{"$f":"IF(Otros_ingresos_imprimir[[#This Row],[Mes 2]]=\"\",\"\",'ANEXO INGRESOS'!J52*'ANEXO INGRESOS'!$F52)","v":""},{"$f":"IF(Otros_ingresos_imprimir[[#This Row],[Mes 3]]=\"\",\"\",'ANEXO INGRESOS'!K52*'ANEXO INGRESOS'!$F52)","v":""},{"$f":"IF(Otros_ingresos_imprimir[[#This Row],[Mes 4]]=\"\",\"\",'ANEXO INGRESOS'!L52*'ANEXO INGRESOS'!$F52)","v":""},{"$f":"IF(Otros_ingresos_imprimir[[#This Row],[Mes 5]]=\"\",\"\",'ANEXO INGRESOS'!M52*'ANEXO INGRESOS'!$F52)","v":""},{"$f":"IF(Otros_ingresos_imprimir[[#This Row],[Mes 6]]=\"\",\"\",'ANEXO INGRESOS'!N52*'ANEXO INGRESOS'!$F52)","v":""},{"$f":"IF(Otros_ingresos_imprimir[[#This Row],[Mes 7]]=\"\",\"\",'ANEXO INGRESOS'!O52*'ANEXO INGRESOS'!$F52)","v":""},{"$f":"IF(Otros_ingresos_imprimir[[#This Row],[Mes 8]]=\"\",\"\",'ANEXO INGRESOS'!P52*'ANEXO INGRESOS'!$F52)","v":""},{"$f":"IF(Otros_ingresos_imprimir[[#This Row],[Mes 9]]=\"\",\"\",'ANEXO INGRESOS'!Q52*'ANEXO INGRESOS'!$F52)","v":""},{"$f":"IF(Otros_ingresos_imprimir[[#This Row],[Mes 10]]=\"\",\"\",'ANEXO INGRESOS'!R52*'ANEXO INGRESOS'!$F52)","v":""},{"$f":"IF(Otros_ingresos_imprimir[[#This Row],[Mes 11]]=\"\",\"\",'ANEXO INGRESOS'!S52*'ANEXO INGRESOS'!$F52)","v":""},0]
[null,{"$f":"IF('ANEXO INGRESOS'!C53<>\"\",'ANEXO INGRESOS'!C53,\"\")","v":""},{"$f":"IF('ANEXO INGRESOS'!D53<>\"\",'ANEXO INGRESOS'!D53,\"\")","v":""},{"$f":"IF(Otros_ingresos_imprimir[[#This Row],[Columna2]]=\"\",\"\",'ANEXO INGRESOS'!H53*'ANEXO INGRESOS'!$F53)","v":""},{"$f":"IF(Otros_ingresos_imprimir[[#This Row],[Mes 1]]=\"\",\"\",'ANEXO INGRESOS'!I53*'ANEXO INGRESOS'!$F53)","v":""},{"$f":"IF(Otros_ingresos_imprimir[[#This Row],[Mes 2]]=\"\",\"\",'ANEXO INGRESOS'!J53*'ANEXO INGRESOS'!$F53)","v":""},{"$f":"IF(Otros_ingresos_imprimir[[#This Row],[Mes 3]]=\"\",\"\",'ANEXO INGRESOS'!K53*'ANEXO INGRESOS'!$F53)","v":""},{"$f":"IF(Otros_ingresos_imprimir[[#This Row],[Mes 4]]=\"\",\"\",'ANEXO INGRESOS'!L53*'ANEXO INGRESOS'!$F53)","v":""},{"$f":"IF(Otros_ingresos_imprimir[[#This Row],[Mes 5]]=\"\",\"\",'ANEXO INGRESOS'!M53*'ANEXO INGRESOS'!$F53)","v":""},{"$f":"IF(Otros_ingresos_imprimir[[#This Row],[Mes 6]]=\"\",\"\",'ANEXO INGRESOS'!N53*'ANEXO INGRESOS'!$F53)","v":""},{"$f":"IF(Otros_ingresos_imprimir[[#This Row],[Mes 7]]=\"\",\"\",'ANEXO INGRESOS'!O53*'ANEXO INGRESOS'!$F53)","v":""},{"$f":"IF(Otros_ingresos_imprimir[[#This Row],[Mes 8]]=\"\",\"\",'ANEXO INGRESOS'!P53*'ANEXO INGRESOS'!$F53)","v":""},{"$f":"IF(Otros_ingresos_imprimir[[#This Row],[Mes 9]]=\"\",\"\",'ANEXO INGRESOS'!Q53*'ANEXO INGRESOS'!$F53)","v":""},{"$f":"IF(Otros_ingresos_imprimir[[#This Row],[Mes 10]]=\"\",\"\",'ANEXO INGRESOS'!R53*'ANEXO INGRESOS'!$F53)","v":""},{"$f":"IF(Otros_ingresos_imprimir[[#This Row],[Mes 11]]=\"\",\"\",'ANEXO INGRESOS'!S53*'ANEXO INGRESOS'!$F53)","v":""},0]
[null,{"$f":"IF('ANEXO INGRESOS'!C54<>\"\",'ANEXO INGRESOS'!C54,\"\")","v":""},{"$f":"IF('ANEXO INGRESOS'!D54<>\"\",'ANEXO INGRESOS'!D54,\"\")","v":""},{"$f":"IF(Otros_ingresos_imprimir[[#This Row],[Columna2]]=\"\",\"\",'ANEXO INGRESOS'!H54*'ANEXO INGRESOS'!$F54)","v":""},{"$f":"IF(Otros_ingresos_imprimir[[#This Row],[Mes 1]]=\"\",\"\",'ANEXO INGRESOS'!I54*'ANEXO INGRESOS'!$F54)","v":""},{"$f":"IF(Otros_ingresos_imprimir[[#This Row],[Mes 2]]=\"\",\"\",'ANEXO INGRESOS'!J54*'ANEXO INGRESOS'!$F54)","v":""},{"$f":"IF(Otros_ingresos_imprimir[[#This Row],[Mes 3]]=\"\",\"\",'ANEXO INGRESOS'!K54*'ANEXO INGRESOS'!$F54)","v":""},{"$f":"IF(Otros_ingresos_imprimir[[#This Row],[Mes 4]]=\"\",\"\",'ANEXO INGRESOS'!L54*'ANEXO INGRESOS'!$F54)","v":""},{"$f":"IF(Otros_ingresos_imprimir[[#This Row],[Mes 5]]=\"\",\"\",'ANEXO INGRESOS'!M54*'ANEXO INGRESOS'!$F54)","v":""},{"$f":"IF(Otros_ingresos_imprimir[[#This Row],[Mes 6]]=\"\",\"\",'ANEXO INGRESOS'!N54*'ANEXO INGRESOS'!$F54)","v":""},{"$f":"IF(Otros_ingresos_imprimir[[#This Row],[Mes 7]]=\"\",\"\",'ANEXO INGRESOS'!O54*'ANEXO INGRESOS'!$F54)","v":""},{"$f":"IF(Otros_ingresos_imprimir[[#This Row],[Mes 8]]=\"\",\"\",'ANEXO INGRESOS'!P54*'ANEXO INGRESOS'!$F54)","v":""},{"$f":"IF(Otros_ingresos_imprimir[[#This Row],[Mes 9]]=\"\",\"\",'ANEXO INGRESOS'!Q54*'ANEXO INGRESOS'!$F54)","v":""},{"$f":"IF(Otros_ingresos_imprimir[[#This Row],[Mes 10]]=\"\",\"\",'ANEXO INGRESOS'!R54*'ANEXO INGRESOS'!$F54)","v":""},{"$f":"IF(Otros_ingresos_imprimir[[#This Row],[Mes 11]]=\"\",\"\",'ANEXO INGRESOS'!S54*'ANEXO INGRESOS'!$F54)","v":""},0]
[null,{"$f":"IF('ANEXO INGRESOS'!C55<>\"\",'ANEXO INGRESOS'!C55,\"\")","v":""},{"$f":"IF('ANEXO INGRESOS'!D55<>\"\",'ANEXO INGRESOS'!D55,\"\")","v":""},{"$f":"IF(Otros_ingresos_imprimir[[#This Row],[Columna2]]=\"\",\"\",'ANEXO INGRESOS'!H55*'ANEXO INGRESOS'!$F55)","v":""},{"$f":"IF(Otros_ingresos_imprimir[[#This Row],[Mes 1]]=\"\",\"\",'ANEXO INGRESOS'!I55*'ANEXO INGRESOS'!$F55)","v":""},{"$f":"IF(Otros_ingresos_imprimir[[#This Row],[Mes 2]]=\"\",\"\",'ANEXO INGRESOS'!J55*'ANEXO INGRESOS'!$F55)","v":""},{"$f":"IF(Otros_ingresos_imprimir[[#This Row],[Mes 3]]=\"\",\"\",'ANEXO INGRESOS'!K55*'ANEXO INGRESOS'!$F55)","v":""},{"$f":"IF(Otros_ingresos_imprimir[[#This Row],[Mes 4]]=\"\",\"\",'ANEXO INGRESOS'!L55*'ANEXO INGRESOS'!$F55)","v":""},{"$f":"IF(Otros_ingresos_imprimir[[#This Row],[Mes 5]]=\"\",\"\",'ANEXO INGRESOS'!M55*'ANEXO INGRESOS'!$F55)","v":""},{"$f":"IF(Otros_ingresos_imprimir[[#This Row],[Mes 6]]=\"\",\"\",'ANEXO INGRESOS'!N55*'ANEXO INGRESOS'!$F55)","v":""},{"$f":"IF(Otros_ingresos_imprimir[[#This Row],[Mes 7]]=\"\",\"\",'ANEXO INGRESOS'!O55*'ANEXO INGRESOS'!$F55)","v":""},{"$f":"IF(Otros_ingresos_imprimir[[#This Row],[Mes 8]]=\"\",\"\",'ANEXO INGRESOS'!P55*'ANEXO INGRESOS'!$F55)","v":""},{"$f":"IF(Otros_ingresos_imprimir[[#This Row],[Mes 9]]=\"\",\"\",'ANEXO INGRESOS'!Q55*'ANEXO INGRESOS'!$F55)","v":""},{"$f":"IF(Otros_ingresos_imprimir[[#This Row],[Mes 10]]=\"\",\"\",'ANEXO INGRESOS'!R55*'ANEXO INGRESOS'!$F55)","v":""},{"$f":"IF(Otros_ingresos_imprimir[[#This Row],[Mes 11]]=\"\",\"\",'ANEXO INGRESOS'!S55*'ANEXO INGRESOS'!$F55)","v":""},{"$f":"SUM(D57:O57)","v":0}]
[null,{"$f":"IF('ANEXO INGRESOS'!C56<>\"\",'ANEXO INGRESOS'!C56,\"\")","v":""},{"$f":"IF('ANEXO INGRESOS'!D56<>\"\",'ANEXO INGRESOS'!D56,\"\")","v":""},{"$f":"IF(Otros_ingresos_imprimir[[#This Row],[Columna2]]=\"\",\"\",'ANEXO INGRESOS'!H56*'ANEXO INGRESOS'!$F56)","v":""},{"$f":"IF(Otros_ingresos_imprimir[[#This Row],[Mes 1]]=\"\",\"\",'ANEXO INGRESOS'!I56*'ANEXO INGRESOS'!$F56)","v":""},{"$f":"IF(Otros_ingresos_imprimir[[#This Row],[Mes 2]]=\"\",\"\",'ANEXO INGRESOS'!J56*'ANEXO INGRESOS'!$F56)","v":""},{"$f":"IF(Otros_ingresos_imprimir[[#This Row],[Mes 3]]=\"\",\"\",'ANEXO INGRESOS'!K56*'ANEXO INGRESOS'!$F56)","v":""},{"$f":"IF(Otros_ingresos_imprimir[[#This Row],[Mes 4]]=\"\",\"\",'ANEXO INGRESOS'!L56*'ANEXO INGRESOS'!$F56)","v":""},{"$f":"IF(Otros_ingresos_imprimir[[#This Row],[Mes 5]]=\"\",\"\",'ANEXO INGRESOS'!M56*'ANEXO INGRESOS'!$F56)","v":""},{"$f":"IF(Otros_ingresos_imprimir[[#This Row],[Mes 6]]=\"\",\"\",'ANEXO INGRESOS'!N56*'ANEXO INGRESOS'!$F56)","v":""},{"$f":"IF(Otros_ingresos_imprimir[[#This Row],[Mes 7]]=\"\",\"\",'ANEXO INGRESOS'!O56*'ANEXO INGRESOS'!$F56)","v":""},{"$f":"IF(Otros_ingresos_imprimir[[#This Row],[Mes 8]]=\"\",\"\",'ANEXO INGRESOS'!P56*'ANEXO INGRESOS'!$F56)","v":""},{"$f":"IF(Otros_ingresos_imprimir[[#This Row],[Mes 9]]=\"\",\"\",'ANEXO INGRESOS'!Q56*'ANEXO INGRESOS'!$F56)","v":""},{"$f":"IF(Otros_ingresos_imprimir[[#This Row],[Mes 10]]=\"\",\"\",'ANEXO INGRESOS'!R56*'ANEXO INGRESOS'!$F56)","v":""},{"$f":"IF(Otros_ingresos_imprimir[[#This Row],[Mes 11]]=\"\",\"\",'ANEXO INGRESOS'!S56*'ANEXO INGRESOS'!$F56)","v":""},{"$f":"SUM(D58:O58)","v":0}]
[null,{"$f":"IF('ANEXO INGRESOS'!C57<>\"\",'ANEXO INGRESOS'!C57,\"\")","v":""},{"$f":"IF('ANEXO INGRESOS'!D57<>\"\",'ANEXO INGRESOS'!D57,\"\")","v":""},{"$f":"IF(Otros_ingresos_imprimir[[#This Row],[Columna2]]=\"\",\"\",'ANEXO INGRESOS'!H57*'ANEXO INGRESOS'!$F57)","v":""},{"$f":"IF(Otros_ingresos_imprimir[[#This Row],[Mes 1]]=\"\",\"\",'ANEXO INGRESOS'!I57*'ANEXO INGRESOS'!$F57)","v":""},{"$f":"IF(Otros_ingresos_imprimir[[#This Row],[Mes 2]]=\"\",\"\",'ANEXO INGRESOS'!J57*'ANEXO INGRESOS'!$F57)","v":""},{"$f":"IF(Otros_ingresos_imprimir[[#This Row],[Mes 3]]=\"\",\"\",'ANEXO INGRESOS'!K57*'ANEXO INGRESOS'!$F57)","v":""},{"$f":"IF(Otros_ingresos_imprimir[[#This Row],[Mes 4]]=\"\",\"\",'ANEXO INGRESOS'!L57*'ANEXO INGRESOS'!$F57)","v":""},{"$f":"IF(Otros_ingresos_imprimir[[#This Row],[Mes 5]]=\"\",\"\",'ANEXO INGRESOS'!M57*'ANEXO INGRESOS'!$F57)","v":""},{"$f":"IF(Otros_ingresos_imprimir[[#This Row],[Mes 6]]=\"\",\"\",'ANEXO INGRESOS'!N57*'ANEXO INGRESOS'!$F57)","v":""},{"$f":"IF(Otros_ingresos_imprimir[[#This Row],[Mes 7]]=\"\",\"\",'ANEXO INGRESOS'!O57*'ANEXO INGRESOS'!$F57)","v":""},{"$f":"IF(Otros_ingresos_imprimir[[#This Row],[Mes 8]]=\"\",\"\",'ANEXO INGRESOS'!P57*'ANEXO INGRESOS'!$F57)","v":""},{"$f":"IF(Otros_ingresos_imprimir[[#This Row],[Mes 9]]=\"\",\"\",'ANEXO INGRESOS'!Q57*'ANEXO INGRESOS'!$F57)","v":""},{"$f":"IF(Otros_ingresos_imprimir[[#This Row],[Mes 10]]=\"\",\"\",'ANEXO INGRESOS'!R57*'ANEXO INGRESOS'!$F57)","v":""},{"$f":"IF(Otros_ingresos_imprimir[[#This Row],[Mes 11]]=\"\",\"\",'ANEXO INGRESOS'!S57*'ANEXO INGRESOS'!$F57)","v":""},0]
[null,{"$f":"IF('ANEXO INGRESOS'!C58<>\"\",'ANEXO INGRESOS'!C58,\"\")","v":""},{"$f":"IF('ANEXO INGRESOS'!D58<>\"\",'ANEXO INGRESOS'!D58,\"\")","v":""},{"$f":"IF(Otros_ingresos_imprimir[[#This Row],[Columna2]]=\"\",\"\",'ANEXO INGRESOS'!H58*'ANEXO INGRESOS'!$F58)","v":""},{"$f":"IF(Otros_ingresos_imprimir[[#This Row],[Mes 1]]=\"\",\"\",'ANEXO INGRESOS'!I58*'ANEXO INGRESOS'!$F58)","v":""},{"$f":"IF(Otros_ingresos_imprimir[[#This Row],[Mes 2]]=\"\",\"\",'ANEXO INGRESOS'!J58*'ANEXO INGRESOS'!$F58)","v":""},{"$f":"IF(Otros_ingresos_imprimir[[#This Row],[Mes 3]]=\"\",\"\",'ANEXO INGRESOS'!K58*'ANEXO INGRESOS'!$F58)","v":""},{"$f":"IF(Otros_ingresos_imprimir[[#This Row],[Mes 4]]=\"\",\"\",'ANEXO INGRESOS'!L58*'ANEXO INGRESOS'!$F58)","v":""},{"$f":"IF(Otros_ingresos_imprimir[[#This Row],[Mes 5]]=\"\",\"\",'ANEXO INGRESOS'!M58*'ANEXO INGRESOS'!$F58)","v":""},{"$f":"IF(Otros_ingresos_imprimir[[#This Row],[Mes 6]]=\"\",\"\",'ANEXO INGRESOS'!N58*'ANEXO INGRESOS'!$F58)","v":""},{"$f":"IF(Otros_ingresos_imprimir[[#This Row],[Mes 7]]=\"\",\"\",'ANEXO INGRESOS'!O58*'ANEXO INGRESOS'!$F58)","v":""},{"$f":"IF(Otros_ingresos_imprimir[[#This Row],[Mes 8]]=\"\",\"\",'ANEXO INGRESOS'!P58*'ANEXO INGRESOS'!$F58)","v":""},{"$f":"IF(Otros_ingresos_imprimir[[#This Row],[Mes 9]]=\"\",\"\",'ANEXO INGRESOS'!Q58*'ANEXO INGRESOS'!$F58)","v":""},{"$f":"IF(Otros_ingresos_imprimir[[#This Row],[Mes 10]]=\"\",\"\",'ANEXO INGRESOS'!R58*'ANEXO INGRESOS'!$F58)","v":""},{"$f":"IF(Otros_ingresos_imprimir[[#This Row],[Mes 11]]=\"\",\"\",'ANEXO INGRESOS'!S58*'ANEXO INGRESOS'!$F58)","v":""},0]
[null,{"$f":"IF('ANEXO INGRESOS'!C59<>\"\",'ANEXO INGRESOS'!C59,\"\")","v":""},{"$f":"IF('ANEXO INGRESOS'!D59<>\"\",'ANEXO INGRESOS'!D59,\"\")","v":""},{"$f":"IF(Otros_ingresos_imprimir[[#This Row],[Columna2]]=\"\",\"\",'ANEXO INGRESOS'!H59*'ANEXO INGRESOS'!$F59)","v":""},{"$f":"IF(Otros_ingresos_imprimir[[#This Row],[Mes 1]]=\"\",\"\",'ANEXO INGRESOS'!I59*'ANEXO INGRESOS'!$F59)","v":""},{"$f":"IF(Otros_ingresos_imprimir[[#This Row],[Mes 2]]=\"\",\"\",'ANEXO INGRESOS'!J59*'ANEXO INGRESOS'!$F59)","v":""},{"$f":"IF(Otros_ingresos_imprimir[[#This Row],[Mes 3]]=\"\",\"\",'ANEXO INGRESOS'!K59*'ANEXO INGRESOS'!$F59)","v":""},{"$f":"IF(Otros_ingresos_imprimir[[#This Row],[Mes 4]]=\"\",\"\",'ANEXO INGRESOS'!L59*'ANEXO INGRESOS'!$F59)","v":""},{"$f":"IF(Otros_ingresos_imprimir[[#This Row],[Mes 5]]=\"\",\"\",'ANEXO INGRESOS'!M59*'ANEXO INGRESOS'!$F59)","v":""},{"$f":"IF(Otros_ingresos_imprimir[[#This Row],[Mes 6]]=\"\",\"\",'ANEXO INGRESOS'!N59*'ANEXO INGRESOS'!$F59)","v":""},{"$f":"IF(Otros_ingresos_imprimir[[#This Row],[Mes 7]]=\"\",\"\",'ANEXO INGRESOS'!O59*'ANEXO INGRESOS'!$F59)","v":""},{"$f":"IF(Otros_ingresos_imprimir[[#This Row],[Mes 8]]=\"\",\"\",'ANEXO INGRESOS'!P59*'ANEXO INGRESOS'!$F59)","v":""},{"$f":"IF(Otros_ingresos_imprimir[[#This Row],[Mes 9]]=\"\",\"\",'ANEXO INGRESOS'!Q59*'ANEXO INGRESOS'!$F59)","v":""},{"$f":"IF(Otros_ingresos_imprimir[[#This Row],[Mes 10]]=\"\",\"\",'ANEXO INGRESOS'!R59*'ANEXO INGRESOS'!$F59)","v":""},{"$f":"IF(Otros_ingresos_imprimir[[#This Row],[Mes 11]]=\"\",\"\",'ANEXO INGRESOS'!S59*'ANEXO INGRESOS'!$F59)","v":""},{"$f":"SUM(D61:O61)","v":0}]
[null,{"$f":"IF('ANEXO INGRESOS'!C60<>\"\",'ANEXO INGRESOS'!C60,\"\")","v":""},{"$f":"IF('ANEXO INGRESOS'!D60<>\"\",'ANEXO INGRESOS'!D60,\"\")","v":""},{"$f":"IF(Otros_ingresos_imprimir[[#This Row],[Columna2]]=\"\",\"\",'ANEXO INGRESOS'!H60*'ANEXO INGRESOS'!$F60)","v":""},{"$f":"IF(Otros_ingresos_imprimir[[#This Row],[Mes 1]]=\"\",\"\",'ANEXO INGRESOS'!I60*'ANEXO INGRESOS'!$F60)","v":""},{"$f":"IF(Otros_ingresos_imprimir[[#This Row],[Mes 2]]=\"\",\"\",'ANEXO INGRESOS'!J60*'ANEXO INGRESOS'!$F60)","v":""},{"$f":"IF(Otros_ingresos_imprimir[[#This Row],[Mes 3]]=\"\",\"\",'ANEXO INGRESOS'!K60*'ANEXO INGRESOS'!$F60)","v":""},{"$f":"IF(Otros_ingresos_imprimir[[#This Row],[Mes 4]]=\"\",\"\",'ANEXO INGRESOS'!L60*'ANEXO INGRESOS'!$F60)","v":""},{"$f":"IF(Otros_ingresos_imprimir[[#This Row],[Mes 5]]=\"\",\"\",'ANEXO INGRESOS'!M60*'ANEXO INGRESOS'!$F60)","v":""},{"$f":"IF(Otros_ingresos_imprimir[[#This Row],[Mes 6]]=\"\",\"\",'ANEXO INGRESOS'!N60*'ANEXO INGRESOS'!$F60)","v":""},{"$f":"IF(Otros_ingresos_imprimir[[#This Row],[Mes 7]]=\"\",\"\",'ANEXO INGRESOS'!O60*'ANEXO INGRESOS'!$F60)","v":""},{"$f":"IF(Otros_ingresos_imprimir[[#This Row],[Mes 8]]=\"\",\"\",'ANEXO INGRESOS'!P60*'ANEXO INGRESOS'!$F60)","v":""},{"$f":"IF(Otros_ingresos_imprimir[[#This Row],[Mes 9]]=\"\",\"\",'ANEXO INGRESOS'!Q60*'ANEXO INGRESOS'!$F60)","v":""},{"$f":"IF(Otros_ingresos_imprimir[[#This Row],[Mes 10]]=\"\",\"\",'ANEXO INGRESOS'!R60*'ANEXO INGRESOS'!$F60)","v":""},{"$f":"IF(Otros_ingresos_imprimir[[#This Row],[Mes 11]]=\"\",\"\",'ANEXO INGRESOS'!S60*'ANEXO INGRESOS'!$F60)","v":""},{"$f":"SUM(D62:O62)","v":0}]
[null,{"$f":"IF('ANEXO INGRESOS'!C61<>\"\",'ANEXO INGRESOS'!C61,\"\")","v":""},{"$f":"IF('ANEXO INGRESOS'!D61<>\"\",'ANEXO INGRESOS'!D61,\"\")","v":""},{"$f":"IF(Otros_ingresos_imprimir[[#This Row],[Columna2]]=\"\",\"\",'ANEXO INGRESOS'!H61*'ANEXO INGRESOS'!$F61)","v":""},{"$f":"IF(Otros_ingresos_imprimir[[#This Row],[Mes 1]]=\"\",\"\",'ANEXO INGRESOS'!I61*'ANEXO INGRESOS'!$F61)","v":""},{"$f":"IF(Otros_ingresos_imprimir[[#This Row],[Mes 2]]=\"\",\"\",'ANEXO INGRESOS'!J61*'ANEXO INGRESOS'!$F61)","v":""},{"$f":"IF(Otros_ingresos_imprimir[[#This Row],[Mes 3]]=\"\",\"\",'ANEXO INGRESOS'!K61*'ANEXO INGRESOS'!$F61)","v":""},{"$f":"IF(Otros_ingresos_imprimir[[#This Row],[Mes 4]]=\"\",\"\",'ANEXO INGRESOS'!L61*'ANEXO INGRESOS'!$F61)","v":""},{"$f":"IF(Otros_ingresos_imprimir[[#This Row],[Mes 5]]=\"\",\"\",'ANEXO INGRESOS'!M61*'ANEXO INGRESOS'!$F61)","v":""},{"$f":"IF(Otros_ingresos_imprimir[[#This Row],[Mes 6]]=\"\",\"\",'ANEXO INGRESOS'!N61*'ANEXO INGRESOS'!$F61)","v":""},{"$f":"IF(Otros_ingresos_imprimir[[#This Row],[Mes 7]]=\"\",\"\",'ANEXO INGRESOS'!O61*'ANEXO INGRESOS'!$F61)","v":""},{"$f":"IF(Otros_ingresos_imprimir[[#This Row],[Mes 8]]=\"\",\"\",'ANEXO INGRESOS'!P61*'ANEXO INGRESOS'!$F61)","v":""},{"$f":"IF(Otros_ingresos_imprimir[[#This Row],[Mes 9]]=\"\",\"\",'ANEXO INGRESOS'!Q61*'ANEXO INGRESOS'!$F61)","v":""},{"$f":"IF(Otros_ingresos_imprimir[[#This Row],[Mes 10]]=\"\",\"\",'ANEXO INGRESOS'!R61*'ANEXO INGRESOS'!$F61)","v":""},{"$f":"IF(Otros_ingresos_imprimir[[#This Row],[Mes 11]]=\"\",\"\",'ANEXO INGRESOS'!S61*'ANEXO INGRESOS'!$F61)","v":""},{"$f":"SUM(D63:O63)","v":0}]
[null,null,"TOTAL OTROS INGRESOS",{"$f":"+SUM(D53:D53)","v":0},0,0,0,0,0,0,0,0,0,0,0,{"$f":"+SUM(P53:P62)","v":0}]
[]
[]
[]
[null,null,null,null,"De año 1 a año 2","De año 2 a año 3","De año 3 a año 4"]
[null,null," INCREMENTO/REDUCCIÓN INGRESOS INTERANUAL EN %",null,{"$f":"+'ANEXO INGRESOS'!C9","v":0},{"$f":"+'ANEXO INGRESOS'!D9","v":0},{"$f":"+'ANEXO INGRESOS'!E9","v":0}]
[]
[null,null,null,"TOTAL AÑO 1 "," TOTAL AÑO 2 ","TOTAL AÑO 3 ","TOTAL AÑO 4 "]
[null,null,"TOTAL VENTAS POR INGRESOS",{"$f":"P13","v":0},{"$f":"D72+$E$69*D72","v":0},{"$f":"D72+F69*D72","v":0},{"$f":"D72+G69*D72","v":0}]
[null,null,"TOTAL OTROS INGRESOS",{"$f":"P14","v":0},{"$f":"D73*E69+D73","v":0},{"$f":"D73*F69+D73","v":0},{"$f":"D73*G69+D73","v":0}]
[null,null,"TOTAL INGRESOS",{"$f":"P17","v":0},{"$f":"D74+E69*D74","v":0},{"$f":"D74+F69*D74","v":0},{"$f":"D74+G69*D74","v":0}]

{"sheet":"5.GASTOS FIJOS","index":12,"n_rows":17,"n_cols":15,"rows_kept":17,"cut":false,"hidden":false,"merged":[]}
[]
[null,"Volver al Indice "]
[null,"Consultar anexo gastos fijos "]
[]
[null,null,null,null,"  "]
[]
[null,"GASTOS FIJOS "]
[]
[]
[null,null,{"$f":"'7.CUENTA DE RESULTADOS '!C20","v":"1900enero"},{"$f":"'7.CUENTA DE RESULTADOS '!D20","v":"1900enero"},{"$f":"'7.CUENTA DE RESULTADOS '!E20","v":"1900febrero"},{"$f":"'7.CUENTA DE RESULTADOS '!F20","v":"1900marzo"},{"$f":"'7.CUENTA DE RESULTADOS '!G20","v":"1900abril"},{"$f":"'7.CUENTA DE RESULTADOS '!H20","v":"1900mayo"},{"$f":"'7.CUENTA DE RESULTADOS '!I20","v":"1900junio"},{"$f":"'7.CUENTA DE RESULTADOS '!J20","v":"1900julio"},{"$f":"'7.CUENTA DE RESULTADOS '!K20","v":"1900agosto"},{"$f":"'7.CUENTA DE RESULTADOS '!L20","v":"1900septiembre"},{"$f":"'7.CUENTA DE RESULTADOS '!M20","v":"1900octubre"},{"$f":"'7.CUENTA DE RESULTADOS '!N20","v":"1900noviembre"},"TOTAL"]
[null,"Importe gastos fijos",{"$f":"SUM(Prevision_mensual_gastos_fijos[[Mes 1 ]])","v":0},{"$f":"SUM(Prevision_mensual_gastos_fijos[Mes 2])","v":0},{"$f":"SUM(Prevision_mensual_gastos_fijos[[Mes 3 ]])","v":0},0.25,{"$f":"SUM(Prevision_mensual_gastos_fijos[[Mes 5 ]])","v":0},{"$f":"SUM(Prevision_mensual_gastos_fijos[[Mes 6 ]])","v":0},{"$f":"SUM(Prevision_mensual_gastos_fijos[[Mes 7 ]])","v":0},{"$f":"SUM(Prevision_mensual_gastos_fijos[[Mes 8 ]])","v":0},{"$f":"SUM(Prevision_mensual_gastos_fijos[[Mes 9 ]])","v":0},{"$f":"SUM(Prevision_mensual_gastos_fijos[[Mes 10 ]])","v":0},{"$f":"SUM(Prevision_mensual_gastos_fijos[[Mes 11 ]])","v":0},{"$f":"SUM(Prevision_mensual_gastos_fijos[[Mes 12 ]])","v":0},{"$f":"SUM(C11:N11)","v":0.25}]
[null,"Iva Gastos Fijos",{"$f":"+'ANEXO GASTOS FIJOS'!D43","v":0},{"$f":"+'ANEXO GASTOS FIJOS'!E43","v":0},{"$f":"+'ANEXO GASTOS FIJOS'!F43","v":0},{"$f":"+'ANEXO GASTOS FIJOS'!G43","v":0},{"$f":"+'ANEXO GASTOS FIJOS'!H43","v":0},{"$f":"+'ANEXO GASTOS FIJOS'!I43","v":0},{"$f":"+'ANEXO GASTOS FIJOS'!J43","v":0},{"$f":"+'ANEXO GASTOS FIJOS'!K43","v":0},{"$f":"+'ANEXO GASTOS FIJOS'!L43","v":0},{"$f":"+'ANEXO GASTOS FIJOS'!M43","v":0},{"$f":"+'ANEXO GASTOS FIJOS'!N43","v":0},{"$f":"+'ANEXO GASTOS FIJOS'!O43","v":0},{"$f":"SUM(C12:N12)","v":0}]
[null,"TOTAL GASTOS ",{"$f":"+C11+C12","v":0},{"$f":"+D11+D12","v":0},0,0.25,0,0,0,0,0,0,0,0,{"$f":"+O11+O12","v":0.25}]
[]
[]
[null,null,null,null,null,"De año 1 a año 2","De año 2 a año 3","De año 3 a año 4"]
[null,null,null,null," INCREMENTO/REDUCCIÓN GASTOS FIJOS  INTERANUAL EN %",{"$f":"+'ANEXO GASTOS FIJOS'!E9","v":0},{"$f":"+'ANEXO GASTOS FIJOS'!F9","v":0},{"$f":"+'ANEXO GASTOS FIJOS'!G9","v":0}]

{"sheet":"6.GASTOS VARIABLES","index":13,"n_rows":164,"n_cols":72,"rows_kept":164,"cut":false,"hidden":false,"merged":[]}
[]
[null,"Volver al Indice "]
[null,"Consultar anexo gastos variables  "]
[]
[]
[]
[]
[null,2.3300000000000001E-2,"GASTOS VARIABLES"]
[]
[null,null,null,{"$f":"'7.CUENTA DE RESULTADOS '!D20","v":"1900enero"},{"$f":"'7.CUENTA DE RESULTADOS '!E20","v":"1900febrero"},{"$f":"'7.CUENTA DE RESULTADOS '!F20","v":"1900marzo"},{"$f":"'7.CUENTA DE RESULTADOS '!G20","v":"1900abril"},{"$f":"'7.CUENTA DE RESULTADOS '!H20","v":"1900mayo"},{"$f":"'7.CUENTA DE RESULTADOS '!I20","v":"1900junio"},{"$f":"'7.CUENTA DE RESULTADOS '!J20","v":"1900julio"},{"$f":"'7.CUENTA DE RESULTADOS '!K20","v":"1900agosto"},{"$f":"'7.CUENTA DE RESULTADOS '!L20","v":"1900septiembre"},{"$f":"'7.CUENTA DE RESULTADOS '!M20","v":"1900octubre"},{"$f":"'7.CUENTA DE RESULTADOS '!N20","v":"1900noviembre"},{"$f":"'7.CUENTA DE RESULTADOS '!O20","v":"AÑO 1"},"TOTAL"]
[null,null,"Importe gastos variables (Sin IVA)",{"$f":"+D52+D146","v":0},{"$f":"+E52+E146","v":0},0,0,0,0,0,0,0,0,0,0,{"$f":"SUM(D11:O11)","v":0}]
[null,null,"Iva gastos variables por producto o servicio",{"$f":"+SUMPRODUCT($B$25:$B$51,D25:D51)","v":0},{"$f":"+SUMPRODUCT($B$25:$B$51,E25:E51)","v":0},0,0,0,0,0,0,0,0,0,0,{"$f":"SUM(D12:O12)","v":0}]
[null,null,"Iva otros gastos variables",{"$f":"+SUMPRODUCT($B$135:$B$145,D135:D145)","v":0},{"$f":"+SUMPRODUCT($B$135:$B$145,E135:E145)","v":0},0,0,0,0,0,0,0,0,0,0,{"$f":"SUM(D13:O13)","v":0}]
[null,null,"TOTAL GASTOS ",{"$f":"+D11+D12+D13","v":0},{"$f":"+E11+E12+E13","v":0},0,0,0,0,0,0,0,0,0,0,{"$f":"+P11+P12","v":0}]
[]
[]
[null,45540]
[null,null,null,null,"De año 1 a año 2","De año 2 a año 3","De año 3 a año 4"]
[null,null," INCREMENTO/REDUCCIÓN GASTOS VARIABLE INTERANUAL EN %",null,{"$f":"+'ANEXO GASTOS VARIABLES'!B11","v":0},{"$f":"+'ANEXO GASTOS VARIABLES'!C11","v":0},{"$f":"+'ANEXO GASTOS VARIABLES'!D11","v":0}]
[]
[]
[null,{"$f":"MEDIA(B25:B51)","v":{"$error":"#NAME?"}}]
[null,null,"GASTOS VARIABLES POR  PRODUCTO O SERVICIO (en euros)",{"$f":"'7.CUENTA DE RESULTADOS '!C20","v":"1900enero"},{"$f":"'7.CUENTA DE RESULTADOS '!D20","v":"1900enero"},{"$f":"'7.CUENTA DE RESULTADOS '!E20","v":"1900febrero"},{"$f":"'7.CUENTA DE RESULTADOS '!F20","v":"1900marzo"},{"$f":"'7.CUENTA DE RESULTADOS '!G20","v":"1900abril"},{"$f":"'7.CUENTA DE RESULTADOS '!H20","v":"1900mayo"},{"$f":"'7.CUENTA DE RESULTADOS '!I20","v":"1900junio"},{"$f":"'7.CUENTA DE RESULTADOS '!J20","v":"1900julio"},{"$f":"'7.CUENTA DE RESULTADOS '!K20","v":"1900agosto"},{"$f":"'7.CUENTA DE RESULTADOS '!L20","v":"1900septiembre"},{"$f":"'7.CUENTA DE RESULTADOS '!M20","v":"1900octubre"},{"$f":"'7.CUENTA DE RESULTADOS '!N20","v":"1900noviembre"}]
[null,"IVA","MES/PRODUCTO","Mes 1 ","Mes 2 ","Mes 3 ","Mes 4 ","Mes 5 ","Mes 6 ","Mes 7","Mes 8","Mes 9","Mes 10","Mes 11 ","Mes 12 ","TOTAL "]
[null,{"$f":"IF(Gastos_variables_producto[[#This Row],[MES/PRODUCTO]]=\"\",\"\",'ANEXO INGRESOS'!C14)","v":""},{"$f":"IF('ANEXO INGRESOS'!D14=\"\",\"\",'ANEXO INGRESOS'!D14)","v":""},{"$f":"IF('ANEXO INGRESOS'!$D14=\"\",\"\",'ANEXO INGRESOS'!H14*'ANEXO GASTOS VARIABLES'!$K$17)","v":""},{"$f":"IF('ANEXO INGRESOS'!$D14=\"\",\"\",'ANEXO INGRESOS'!I14*'ANEXO GASTOS VARIABLES'!$K$17)","v":""},{"$f":"IF('ANEXO INGRESOS'!$D14=\"\",\"\",'ANEXO INGRESOS'!J14*'ANEXO GASTOS VARIABLES'!$K$17)","v":""},{"$f":"IF('ANEXO INGRESOS'!$D14=\"\",\"\",'ANEXO INGRESOS'!K14*'ANEXO GASTOS VARIABLES'!$K$17)","v":""},{"$f":"IF('ANEXO INGRESOS'!$D14=\"\",\"\",'ANEXO INGRESOS'!L14*'ANEXO GASTOS VARIABLES'!$K$17)","v":""},{"$f":"IF('ANEXO INGRESOS'!$D14=\"\",\"\",'ANEXO INGRESOS'!M14*'ANEXO GASTOS VARIABLES'!$K$17)","v":""},{"$f":"IF('ANEXO INGRESOS'!$D14=\"\",\"\",'ANEXO INGRESOS'!N14*'ANEXO GASTOS VARIABLES'!$K$17)","v":""},{"$f":"IF('ANEXO INGRESOS'!$D14=\"\",\"\",'ANEXO INGRESOS'!O14*'ANEXO GASTOS VARIABLES'!$K$17)","v":""},{"$f":"IF('ANEXO INGRESOS'!$D14=\"\",\"\",'ANEXO INGRESOS'!P14*'ANEXO GASTOS VARIABLES'!$K$17)","v":""},{"$f":"IF('ANEXO INGRESOS'!$D14=\"\",\"\",'ANEXO INGRESOS'!Q14*'ANEXO GASTOS VARIABLES'!$K$17)","v":""},{"$f":"IF('ANEXO INGRESOS'!$D14=\"\",\"\",'ANEXO INGRESOS'!R14*'ANEXO GASTOS VARIABLES'!$K$17)","v":""},{"$f":"IF('ANEXO INGRESOS'!$D14=\"\",\"\",'ANEXO INGRESOS'!S14*'ANEXO GASTOS VARIABLES'!$K$17)","v":""},{"$f":"IF(Gastos_variables_producto[[#This Row],[MES/PRODUCTO]]=\"\",\"\",SUM('6.GASTOS VARIABLES'!$C25:$O25))","v":""}]
[null,{"$f":"IF(Gastos_variables_producto[[#This Row],[MES/PRODUCTO]]=\"\",\"\",'ANEXO INGRESOS'!C15)","v":""},{"$f":"IF('ANEXO INGRESOS'!D15=\"\",\"\",'ANEXO INGRESOS'!D15)","v":""},{"$f":"IF('ANEXO INGRESOS'!$D15=\"\",\"\",'ANEXO INGRESOS'!H15*'ANEXO GASTOS VARIABLES'!$K$17)","v":""},{"$f":"IF('ANEXO INGRESOS'!$D15=\"\",\"\",'ANEXO INGRESOS'!I15*'ANEXO GASTOS VARIABLES'!$K$17)","v":""},{"$f":"IF('ANEXO INGRESOS'!$D15=\"\",\"\",'ANEXO INGRESOS'!J15*'ANEXO GASTOS VARIABLES'!$K$17)","v":""},{"$f":"IF('ANEXO INGRESOS'!$D15=\"\",\"\",'ANEXO INGRESOS'!K15*'ANEXO GASTOS VARIABLES'!$K$17)","v":""},{"$f":"IF('ANEXO INGRESOS'!$D15=\"\",\"\",'ANEXO INGRESOS'!L15*'ANEXO GASTOS VARIABLES'!$K$17)","v":""},{"$f":"IF('ANEXO INGRESOS'!$D15=\"\",\"\",'ANEXO INGRESOS'!M15*'ANEXO GASTOS VARIABLES'!$K$17)","v":""},{"$f":"IF('ANEXO INGRESOS'!$D15=\"\",\"\",'ANEXO INGRESOS'!N15*'ANEXO GASTOS VARIABLES'!$K$17)","v":""},{"$f":"IF('ANEXO INGRESOS'!$D15=\"\",\"\",'ANEXO INGRESOS'!O15*'ANEXO GASTOS VARIABLES'!$K$17)","v":""},{"$f":"IF('ANEXO INGRESOS'!$D15=\"\",\"\",'ANEXO INGRESOS'!P15*'ANEXO GASTOS VARIABLES'!$K$17)","v":""},{"$f":"IF('ANEXO INGRESOS'!$D15=\"\",\"\",'ANEXO INGRESOS'!Q15*'ANEXO GASTOS VARIABLES'!$K$17)","v":""},{"$f":"IF('ANEXO INGRESOS'!$D15=\"\",\"\",'ANEXO INGRESOS'!R15*'ANEXO GASTOS VARIABLES'!$K$17)","v":""},{"$f":"IF('ANEXO INGRESOS'!$D15=\"\",\"\",'ANEXO INGRESOS'!S15*'ANEXO GASTOS VARIABLES'!$K$17)","v":""},{"$f":"IF(Gastos_variables_producto[[#This Row],[MES/PRODUCTO]]=\"\",\"\",SUM('6.GASTOS VARIABLES'!$C26:$O26))","v":""}]
[null,{"$f":"IF(Gastos_variables_producto[[#This Row],[MES/PRODUCTO]]=\"\",\"\",'ANEXO INGRESOS'!C16)","v":""},{"$f":"IF('ANEXO INGRESOS'!D16=\"\",\"\",'ANEXO INGRESOS'!D16)","v":""},{"$f":"IF('ANEXO INGRESOS'!$D16=\"\",\"\",'ANEXO INGRESOS'!H16*'ANEXO GASTOS VARIABLES'!$K$17)","v":""},{"$f":"IF('ANEXO INGRESOS'!$D16=\"\",\"\",'ANEXO INGRESOS'!I16*'ANEXO GASTOS VARIABLES'!$K$17)","v":""},{"$f":"IF('ANEXO INGRESOS'!$D16=\"\",\"\",'ANEXO INGRESOS'!J16*'ANEXO GASTOS VARIABLES'!$K$17)","v":""},{"$f":"IF('ANEXO INGRESOS'!$D16=\"\",\"\",'ANEXO INGRESOS'!K16*'ANEXO GASTOS VARIABLES'!$K$17)","v":""},{"$f":"IF('ANEXO INGRESOS'!$D16=\"\",\"\",'ANEXO INGRESOS'!L16*'ANEXO GASTOS VARIABLES'!$K$17)","v":""},{"$f":"IF('ANEXO INGRESOS'!$D16=\"\",\"\",'ANEXO INGRESOS'!M16*'ANEXO GASTOS VARIABLES'!$K$17)","v":""},{"$f":"IF('ANEXO INGRESOS'!$D16=\"\",\"\",'ANEXO INGRESOS'!N16*'ANEXO GASTOS VARIABLES'!$K$17)","v":""},{"$f":"IF('ANEXO INGRESOS'!$D16=\"\",\"\",'ANEXO INGRESOS'!O16*'ANEXO GASTOS VARIABLES'!$K$17)","v":""},{"$f":"IF('ANEXO INGRESOS'!$D16=\"\",\"\",'ANEXO INGRESOS'!P16*'ANEXO GASTOS VARIABLES'!$K$17)","v":""},{"$f":"IF('ANEXO INGRESOS'!$D16=\"\",\"\",'ANEXO INGRESOS'!Q16*'ANEXO GASTOS VARIABLES'!$K$17)","v":""},{"$f":"IF('ANEXO INGRESOS'!$D16=\"\",\"\",'ANEXO INGRESOS'!R16*'ANEXO GASTOS VARIABLES'!$K$17)","v":""},{"$f":"IF('ANEXO INGRESOS'!$D16=\"\",\"\",'ANEXO INGRESOS'!S16*'ANEXO GASTOS VARIABLES'!$K$17)","v":""},{"$f":"IF(Gastos_variables_producto[[#This Row],[MES/PRODUCTO]]=\"\",\"\",SUM('6.GASTOS VARIABLES'!$C27:$O27))","v":""}]
[null,{"$f":"IF(Gastos_variables_producto[[#This Row],[MES/PRODUCTO]]=\"\",\"\",'ANEXO INGRESOS'!C17)","v":""},{"$f":"IF('ANEXO INGRESOS'!D17=\"\",\"\",'ANEXO INGRESOS'!D17)","v":""},{"$f":"IF('ANEXO INGRESOS'!$D17=\"\",\"\",'ANEXO INGRESOS'!H17*'ANEXO GASTOS VARIABLES'!$K$17)","v":""},{"$f":"IF('ANEXO INGRESOS'!$D17=\"\",\"\",'ANEXO INGRESOS'!I17*'ANEXO GASTOS VARIABLES'!$K$17)","v":""},{"$f":"IF('ANEXO INGRESOS'!$D17=\"\",\"\",'ANEXO INGRESOS'!J17*'ANEXO GASTOS VARIABLES'!$K$17)","v":""},{"$f":"IF('ANEXO INGRESOS'!$D17=\"\",\"\",'ANEXO INGRESOS'!K17*'ANEXO GASTOS VARIABLES'!$K$17)","v":""},{"$f":"IF('ANEXO INGRESOS'!$D17=\"\",\"\",'ANEXO INGRESOS'!L17*'ANEXO GASTOS VARIABLES'!$K$17)","v":""},{"$f":"IF('ANEXO INGRESOS'!$D17=\"\",\"\",'ANEXO INGRESOS'!M17*'ANEXO GASTOS VARIABLES'!$K$17)","v":""},{"$f":"IF('ANEXO INGRESOS'!$D17=\"\",\"\",'ANEXO INGRESOS'!N17*'ANEXO GASTOS VARIABLES'!$K$17)","v":""},{"$f":"IF('ANEXO INGRESOS'!$D17=\"\",\"\",'ANEXO INGRESOS'!O17*'ANEXO GASTOS VARIABLES'!$K$17)","v":""},{"$f":"IF('ANEXO INGRESOS'!$D17=\"\",\"\",'ANEXO INGRESOS'!P17*'ANEXO GASTOS VARIABLES'!$K$17)","v":""},{"$f":"IF('ANEXO INGRESOS'!$D17=\"\",\"\",'ANEXO INGRESOS'!Q17*'ANEXO GASTOS VARIABLES'!$K$17)","v":""},{"$f":"IF('ANEXO INGRESOS'!$D17=\"\",\"\",'ANEXO INGRESOS'!R17*'ANEXO GASTOS VARIABLES'!$K$17)","v":""},{"$f":"IF('ANEXO INGRESOS'!$D17=\"\",\"\",'ANEXO INGRESOS'!S17*'ANEXO GASTOS VARIABLES'!$K$17)","v":""},{"$f":"IF(Gastos_variables_producto[[#This Row],[MES/PRODUCTO]]=\"\",\"\",SUM('6.GASTOS VARIABLES'!$C28:$O28))","v":""}]
[null,{"$f":"IF(Gastos_variables_producto[[#This Row],[MES/PRODUCTO]]=\"\",\"\",'ANEXO INGRESOS'!C18)","v":""},{"$f":"IF('ANEXO INGRESOS'!D18=\"\",\"\",'ANEXO INGRESOS'!D18)","v":""},{"$f":"IF('ANEXO INGRESOS'!$D18=\"\",\"\",'ANEXO INGRESOS'!H18*'ANEXO GASTOS VARIABLES'!$K$17)","v":""},{"$f":"IF('ANEXO INGRESOS'!$D18=\"\",\"\",'ANEXO INGRESOS'!I18*'ANEXO GASTOS VARIABLES'!$K$17)","v":""},{"$f":"IF('ANEXO INGRESOS'!$D18=\"\",\"\",'ANEXO INGRESOS'!J18*'ANEXO GASTOS VARIABLES'!$K$17)","v":""},{"$f":"IF('ANEXO INGRESOS'!$D18=\"\",\"\",'ANEXO INGRESOS'!K18*'ANEXO GASTOS VARIABLES'!$K$17)","v":""},{"$f":"IF('ANEXO INGRESOS'!$D18=\"\",\"\",'ANEXO INGRESOS'!L18*'ANEXO GASTOS VARIABLES'!$K$17)","v":""},{"$f":"IF('ANEXO INGRESOS'!$D18=\"\",\"\",'ANEXO INGRESOS'!M18*'ANEXO GASTOS VARIABLES'!$K$17)","v":""},{"$f":"IF('ANEXO INGRESOS'!$D18=\"\",\"\",'ANEXO INGRESOS'!N18*'ANEXO GASTOS VARIABLES'!$K$17)","v":""},{"$f":"IF('ANEXO INGRESOS'!$D18=\"\",\"\",'ANEXO INGRESOS'!O18*'ANEXO GASTOS VARIABLES'!$K$17)","v":""},{"$f":"IF('ANEXO INGRESOS'!$D18=\"\",\"\",'ANEXO INGRESOS'!P18*'ANEXO GASTOS VARIABLES'!$K$17)","v":""},{"$f":"IF('ANEXO INGRESOS'!$D18=\"\",\"\",'ANEXO INGRESOS'!Q18*'ANEXO GASTOS VARIABLES'!$K$17)","v":""},{"$f":"IF('ANEXO INGRESOS'!$D18=\"\",\"\",'ANEXO INGRESOS'!R18*'ANEXO GASTOS VARIABLES'!$K$17)","v":""},{"$f":"IF('ANEXO INGRESOS'!$D18=\"\",\"\",'ANEXO INGRESOS'!S18*'ANEXO GASTOS VARIABLES'!$K$17)","v":""},{"$f":"IF(Gastos_variables_producto[[#This Row],[MES/PRODUCTO]]=\"\",\"\",SUM('6.GASTOS VARIABLES'!$C29:$O29))","v":""}]
[null,{"$f":"IF(Gastos_variables_producto[[#This Row],[MES/PRODUCTO]]=\"\",\"\",'ANEXO INGRESOS'!C19)","v":""},{"$f":"IF('ANEXO INGRESOS'!D19=\"\",\"\",'ANEXO INGRESOS'!D19)","v":""},{"$f":"IF('ANEXO INGRESOS'!$D19=\"\",\"\",'ANEXO INGRESOS'!H19*'ANEXO GASTOS VARIABLES'!$K$17)","v":""},{"$f":"IF('ANEXO INGRESOS'!$D19=\"\",\"\",'ANEXO INGRESOS'!I19*'ANEXO GASTOS VARIABLES'!$K$17)","v":""},{"$f":"IF('ANEXO INGRESOS'!$D19=\"\",\"\",'ANEXO INGRESOS'!J19*'ANEXO GASTOS VARIABLES'!$K$17)","v":""},{"$f":"IF('ANEXO INGRESOS'!$D19=\"\",\"\",'ANEXO INGRESOS'!K19*'ANEXO GASTOS VARIABLES'!$K$17)","v":""},{"$f":"IF('ANEXO INGRESOS'!$D19=\"\",\"\",'ANEXO INGRESOS'!L19*'ANEXO GASTOS VARIABLES'!$K$17)","v":""},{"$f":"IF('ANEXO INGRESOS'!$D19=\"\",\"\",'ANEXO INGRESOS'!M19*'ANEXO GASTOS VARIABLES'!$K$17)","v":""},{"$f":"IF('ANEXO INGRESOS'!$D19=\"\",\"\",'ANEXO INGRESOS'!N19*'ANEXO GASTOS VARIABLES'!$K$17)","v":""},{"$f":"IF('ANEXO INGRESOS'!$D19=\"\",\"\",'ANEXO INGRESOS'!O19*'ANEXO GASTOS VARIABLES'!$K$17)","v":""},{"$f":"IF('ANEXO INGRESOS'!$D19=\"\",\"\",'ANEXO INGRESOS'!P19*'ANEXO GASTOS VARIABLES'!$K$17)","v":""},{"$f":"IF('ANEXO INGRESOS'!$D19=\"\",\"\",'ANEXO INGRESOS'!Q19*'ANEXO GASTOS VARIABLES'!$K$17)","v":""},{"$f":"IF('ANEXO INGRESOS'!$D19=\"\",\"\",'ANEXO INGRESOS'!R19*'ANEXO GASTOS VARIABLES'!$K$17)","v":""},{"$f":"IF('ANEXO INGRESOS'!$D19=\"\",\"\",'ANEXO INGRESOS'!S19*'ANEXO GASTOS VARIABLES'!$K$17)","v":""},{"$f":"IF(Gastos_variables_producto[[#This Row],[MES/PRODUCTO]]=\"\",\"\",SUM('6.GASTOS VARIABLES'!$C30:$O30))","v":""}]
[null,{"$f":"IF(Gastos_variables_producto[[#This Row],[MES/PRODUCTO]]=\"\",\"\",'ANEXO INGRESOS'!C20)","v":""},{"$f":"IF('ANEXO INGRESOS'!D20=\"\",\"\",'ANEXO INGRESOS'!D20)","v":""},{"$f":"IF('ANEXO INGRESOS'!$D20=\"\",\"\",'ANEXO INGRESOS'!H20*'ANEXO GASTOS VARIABLES'!$K$17)","v":""},{"$f":"IF('ANEXO INGRESOS'!$D20=\"\",\"\",'ANEXO INGRESOS'!I20*'ANEXO GASTOS VARIABLES'!$K$17)","v":""},{"$f":"IF('ANEXO INGRESOS'!$D20=\"\",\"\",'ANEXO INGRESOS'!J20*'ANEXO GASTOS VARIABLES'!$K$17)","v":""},{"$f":"IF('ANEXO INGRESOS'!$D20=\"\",\"\",'ANEXO INGRESOS'!K20*'ANEXO GASTOS VARIABLES'!$K$17)","v":""},{"$f":"IF('ANEXO INGRESOS'!$D20=\"\",\"\",'ANEXO INGRESOS'!L20*'ANEXO GASTOS VARIABLES'!$K$17)","v":""},{"$f":"IF('ANEXO INGRESOS'!$D20=\"\",\"\",'ANEXO INGRESOS'!M20*'ANEXO GASTOS VARIABLES'!$K$17)","v":""},{"$f":"IF('ANEXO INGRESOS'!$D20=\"\",\"\",'ANEXO INGRESOS'!N20*'ANEXO GASTOS VARIABLES'!$K$17)","v":""},{"$f":"IF('ANEXO INGRESOS'!$D20=\"\",\"\",'ANEXO INGRESOS'!O20*'ANEXO GASTOS VARIABLES'!$K$17)","v":""},{"$f":"IF('ANEXO INGRESOS'!$D20=\"\",\"\",'ANEXO INGRESOS'!P20*'ANEXO GASTOS VARIABLES'!$K$17)","v":""},{"$f":"IF('ANEXO INGRESOS'!$D20=\"\",\"\",'ANEXO INGRESOS'!Q20*'ANEXO GASTOS VARIABLES'!$K$17)","v":""},{"$f":"IF('ANEXO INGRESOS'!$D20=\"\",\"\",'ANEXO INGRESOS'!R20*'ANEXO GASTOS VARIABLES'!$K$17)","v":""},{"$f":"IF('ANEXO INGRESOS'!$D20=\"\",\"\",'ANEXO INGRESOS'!S20*'ANEXO GASTOS VARIABLES'!$K$17)","v":""},{"$f":"IF(Gastos_variables_producto[[#This Row],[MES/PRODUCTO]]=\"\",\"\",SUM('6.GASTOS VARIABLES'!$C31:$O31))","v":""}]
[null,{"$f":"IF(Gastos_variables_producto[[#This Row],[MES/PRODUCTO]]=\"\",\"\",'ANEXO INGRESOS'!C21)","v":""},{"$f":"IF('ANEXO INGRESOS'!D21=\"\",\"\",'ANEXO INGRESOS'!D21)","v":""},{"$f":"IF('ANEXO INGRESOS'!$D21=\"\",\"\",'ANEXO INGRESOS'!H21*'ANEXO GASTOS VARIABLES'!$K$17)","v":""},{"$f":"IF('ANEXO INGRESOS'!$D21=\"\",\"\",'ANEXO INGRESOS'!I21*'ANEXO GASTOS VARIABLES'!$K$17)","v":""},{"$f":"IF('ANEXO INGRESOS'!$D21=\"\",\"\",'ANEXO INGRESOS'!J21*'ANEXO GASTOS VARIABLES'!$K$17)","v":""},{"$f":"IF('ANEXO INGRESOS'!$D21=\"\",\"\",'ANEXO INGRESOS'!K21*'ANEXO GASTOS VARIABLES'!$K$17)","v":""},{"$f":"IF('ANEXO INGRESOS'!$D21=\"\",\"\",'ANEXO INGRESOS'!L21*'ANEXO GASTOS VARIABLES'!$K$17)","v":""},{"$f":"IF('ANEXO INGRESOS'!$D21=\"\",\"\",'ANEXO INGRESOS'!M21*'ANEXO GASTOS VARIABLES'!$K$17)","v":""},{"$f":"IF('ANEXO INGRESOS'!$D21=\"\",\"\",'ANEXO INGRESOS'!N21*'ANEXO GASTOS VARIABLES'!$K$17)","v":""},{"$f":"IF('ANEXO INGRESOS'!$D21=\"\",\"\",'ANEXO INGRESOS'!O21*'ANEXO GASTOS VARIABLES'!$K$17)","v":""},{"$f":"IF('ANEXO INGRESOS'!$D21=\"\",\"\",'ANEXO INGRESOS'!P21*'ANEXO GASTOS VARIABLES'!$K$17)","v":""},{"$f":"IF('ANEXO INGRESOS'!$D21=\"\",\"\",'ANEXO INGRESOS'!Q21*'ANEXO GASTOS VARIABLES'!$K$17)","v":""},{"$f":"IF('ANEXO INGRESOS'!$D21=\"\",\"\",'ANEXO INGRESOS'!R21*'ANEXO GASTOS VARIABLES'!$K$17)","v":""},{"$f":"IF('ANEXO INGRESOS'!$D21=\"\",\"\",'ANEXO INGRESOS'!S21*'ANEXO GASTOS VARIABLES'!$K$17)","v":""},{"$f":"IF(Gastos_variables_producto[[#This Row],[MES/PRODUCTO]]=\"\",\"\",SUM('6.GASTOS VARIABLES'!$C32:$O32))","v":""}]
[null,{"$f":"IF(Gastos_variables_producto[[#This Row],[MES/PRODUCTO]]=\"\",\"\",'ANEXO INGRESOS'!C22)","v":""},{"$f":"IF('ANEXO INGRESOS'!D22=\"\",\"\",'ANEXO INGRESOS'!D22)","v":""},{"$f":"IF('ANEXO INGRESOS'!$D22=\"\",\"\",'ANEXO INGRESOS'!H22*'ANEXO GASTOS VARIABLES'!$K$17)","v":""},{"$f":"IF('ANEXO INGRESOS'!$D22=\"\",\"\",'ANEXO INGRESOS'!I22*'ANEXO GASTOS VARIABLES'!$K$17)","v":""},{"$f":"IF('ANEXO INGRESOS'!$D22=\"\",\"\",'ANEXO INGRESOS'!J22*'ANEXO GASTOS VARIABLES'!$K$17)","v":""},{"$f":"IF('ANEXO INGRESOS'!$D22=\"\",\"\",'ANEXO INGRESOS'!K22*'ANEXO GASTOS VARIABLES'!$K$17)","v":""},{"$f":"IF('ANEXO INGRESOS'!$D22=\"\",\"\",'ANEXO INGRESOS'!L22*'ANEXO GASTOS VARIABLES'!$K$17)","v":""},{"$f":"IF('ANEXO INGRESOS'!$D22=\"\",\"\",'ANEXO INGRESOS'!M22*'ANEXO GASTOS VARIABLES'!$K$17)","v":""},{"$f":"IF('ANEXO INGRESOS'!$D22=\"\",\"\",'ANEXO INGRESOS'!N22*'ANEXO GASTOS VARIABLES'!$K$17)","v":""},{"$f":"IF('ANEXO INGRESOS'!$D22=\"\",\"\",'ANEXO INGRESOS'!O22*'ANEXO GASTOS VARIABLES'!$K$17)","v":""},{"$f":"IF('ANEXO INGRESOS'!$D22=\"\",\"\",'ANEXO INGRESOS'!P22*'ANEXO GASTOS VARIABLES'!$K$17)","v":""},{"$f":"IF('ANEXO INGRESOS'!$D22=\"\",\"\",'ANEXO INGRESOS'!Q22*'ANEXO GASTOS VARIABLES'!$K$17)","v":""},{"$f":"IF('ANEXO INGRESOS'!$D22=\"\",\"\",'ANEXO INGRESOS'!R22*'ANEXO GASTOS VARIABLES'!$K$17)","v":""},{"$f":"IF('ANEXO INGRESOS'!$D22=\"\",\"\",'ANEXO INGRESOS'!S22*'ANEXO GASTOS VARIABLES'!$K$17)","v":""},{"$f":"IF(Gastos_variables_producto[[#This Row],[MES/PRODUCTO]]=\"\",\"\",SUM('6.GASTOS VARIABLES'!$C33:$O33))","v":""}]
[null,{"$f":"IF(Gastos_variables_producto[[#This Row],[MES/PRODUCTO]]=\"\",\"\",'ANEXO INGRESOS'!C23)","v":""},{"$f":"IF('ANEXO INGRESOS'!D23=\"\",\"\",'ANEXO INGRESOS'!D23)","v":""},{"$f":"IF('ANEXO INGRESOS'!$D23=\"\",\"\",'ANEXO INGRESOS'!H23*'ANEXO GASTOS VARIABLES'!$K$17)","v":""},{"$f":"IF('ANEXO INGRESOS'!$D23=\"\",\"\",'ANEXO INGRESOS'!I23*'ANEXO GASTOS VARIABLES'!$K$17)","v":""},{"$f":"IF('ANEXO INGRESOS'!$D23=\"\",\"\",'ANEXO INGRESOS'!J23*'ANEXO GASTOS VARIABLES'!$K$17)","v":""},{"$f":"IF('ANEXO INGRESOS'!$D23=\"\",\"\",'ANEXO INGRESOS'!K23*'ANEXO GASTOS VARIABLES'!$K$17)","v":""},{"$f":"IF('ANEXO INGRESOS'!$D23=\"\",\"\",'ANEXO INGRESOS'!L23*'ANEXO GASTOS VARIABLES'!$K$17)","v":""},{"$f":"IF('ANEXO INGRESOS'!$D23=\"\",\"\",'ANEXO INGRESOS'!M23*'ANEXO GASTOS VARIABLES'!$K$17)","v":""},{"$f":"IF('ANEXO INGRESOS'!$D23=\"\",\"\",'ANEXO INGRESOS'!N23*'ANEXO GASTOS VARIABLES'!$K$17)","v":""},{"$f":"IF('ANEXO INGRESOS'!$D23=\"\",\"\",'ANEXO INGRESOS'!O23*'ANEXO GASTOS VARIABLES'!$K$17)","v":""},{"$f":"IF('ANEXO INGRESOS'!$D23=\"\",\"\",'ANEXO INGRESOS'!P23*'ANEXO GASTOS VARIABLES'!$K$17)","v":""},{"$f":"IF('ANEXO INGRESOS'!$D23=\"\",\"\",'ANEXO INGRESOS'!Q23*'ANEXO GASTOS VARIABLES'!$K$17)","v":""},{"$f":"IF('ANEXO INGRESOS'!$D23=\"\",\"\",'ANEXO INGRESOS'!R23*'ANEXO GASTOS VARIABLES'!$K$17)","v":""},{"$f":"IF('ANEXO INGRESOS'!$D23=\"\",\"\",'ANEXO INGRESOS'!S23*'ANEXO GASTOS VARIABLES'!$K$17)","v":""},{"$f":"IF(Gastos_variables_producto[[#This Row],[MES/PRODUCTO]]=\"\",\"\",SUM('6.GASTOS VARIABLES'!$C34:$O34))","v":""}]
[null,{"$f":"IF(Gastos_variables_producto[[#This Row],[MES/PRODUCTO]]=\"\",\"\",'ANEXO INGRESOS'!C24)","v":""},{"$f":"IF('ANEXO INGRESOS'!D24=\"\",\"\",'ANEXO INGRESOS'!D24)","v":""},{"$f":"IF('ANEXO INGRESOS'!$D24=\"\",\"\",'ANEXO INGRESOS'!H24*'ANEXO GASTOS VARIABLES'!$K$17)","v":""},{"$f":"IF('ANEXO INGRESOS'!$D24=\"\",\"\",'ANEXO INGRESOS'!I24*'ANEXO GASTOS VARIABLES'!$K$17)","v":""},{"$f":"IF('ANEXO INGRESOS'!$D24=\"\",\"\",'ANEXO INGRESOS'!J24*'ANEXO GASTOS VARIABLES'!$K$17)","v":""},{"$f":"IF('ANEXO INGRESOS'!$D24=\"\",\"\",'ANEXO INGRESOS'!K24*'ANEXO GASTOS VARIABLES'!$K$17)","v":""},{"$f":"IF('ANEXO INGRESOS'!$D24=\"\",\"\",'ANEXO INGRESOS'!L24*'ANEXO GASTOS VARIABLES'!$K$17)","v":""},{"$f":"IF('ANEXO INGRESOS'!$D24=\"\",\"\",'ANEXO INGRESOS'!M24*'ANEXO GASTOS VARIABLES'!$K$17)","v":""},{"$f":"IF('ANEXO INGRESOS'!$D24=\"\",\"\",'ANEXO INGRESOS'!N24*'ANEXO GASTOS VARIABLES'!$K$17)","v":""},{"$f":"IF('ANEXO INGRESOS'!$D24=\"\",\"\",'ANEXO INGRESOS'!O24*'ANEXO GASTOS VARIABLES'!$K$17)","v":""},{"$f":"IF('ANEXO INGRESOS'!$D24=\"\",\"\",'ANEXO INGRESOS'!P24*'ANEXO GASTOS VARIABLES'!$K$17)","v":""},{"$f":"IF('ANEXO INGRESOS'!$D24=\"\",\"\",'ANEXO INGRESOS'!Q24*'ANEXO GASTOS VARIABLES'!$K$17)","v":""},{"$f":"IF('ANEXO INGRESOS'!$D24=\"\",\"\",'ANEXO INGRESOS'!R24*'ANEXO GASTOS VARIABLES'!$K$17)","v":""},{"$f":"IF('ANEXO INGRESOS'!$D24=\"\",\"\",'ANEXO INGRESOS'!S24*'ANEXO GASTOS VARIABLES'!$K$17)","v":""},{"$f":"IF(Gastos_variables_producto[[#This Row],[MES/PRODUCTO]]=\"\",\"\",SUM('6.GASTOS VARIABLES'!$C35:$O35))","v":""}]
[null,{"$f":"IF(Gastos_variables_producto[[#This Row],[MES/PRODUCTO]]=\"\",\"\",'ANEXO INGRESOS'!C25)","v":""},{"$f":"IF('ANEXO INGRESOS'!D25=\"\",\"\",'ANEXO INGRESOS'!D25)","v":""},{"$f":"IF('ANEXO INGRESOS'!$D25=\"\",\"\",'ANEXO INGRESOS'!H25*'ANEXO GASTOS VARIABLES'!$K$17)","v":""},{"$f":"IF('ANEXO INGRESOS'!$D25=\"\",\"\",'ANEXO INGRESOS'!I25*'ANEXO GASTOS VARIABLES'!$K$17)","v":""},{"$f":"IF('ANEXO INGRESOS'!$D25=\"\",\"\",'ANEXO INGRESOS'!J25*'ANEXO GASTOS VARIABLES'!$K$17)","v":""},{"$f":"IF('ANEXO INGRESOS'!$D25=\"\",\"\",'ANEXO INGRESOS'!K25*'ANEXO GASTOS VARIABLES'!$K$17)","v":""},{"$f":"IF('ANEXO INGRESOS'!$D25=\"\",\"\",'ANEXO INGRESOS'!L25*'ANEXO GASTOS VARIABLES'!$K$17)","v":""},{"$f":"IF('ANEXO INGRESOS'!$D25=\"\",\"\",'ANEXO INGRESOS'!M25*'ANEXO GASTOS VARIABLES'!$K$17)","v":""},{"$f":"IF('ANEXO INGRESOS'!$D25=\"\",\"\",'ANEXO INGRESOS'!N25*'ANEXO GASTOS VARIABLES'!$K$17)","v":""},{"$f":"IF('ANEXO INGRESOS'!$D25=\"\",\"\",'ANEXO INGRESOS'!O25*'ANEXO GASTOS VARIABLES'!$K$17)","v":""},{"$f":"IF('ANEXO INGRESOS'!$D25=\"\",\"\",'ANEXO INGRESOS'!P25*'ANEXO GASTOS VARIABLES'!$K$17)","v":""},{"$f":"IF('ANEXO INGRESOS'!$D25=\"\",\"\",'ANEXO INGRESOS'!Q25*'ANEXO GASTOS VARIABLES'!$K$17)","v":""},{"$f":"IF('ANEXO INGRESOS'!$D25=\"\",\"\",'ANEXO INGRESOS'!R25*'ANEXO GASTOS VARIABLES'!$K$17)","v":""},{"$f":"IF('ANEXO INGRESOS'!$D25=\"\",\"\",'ANEXO INGRESOS'!S25*'ANEXO GASTOS VARIABLES'!$K$17)","v":""},{"$f":"IF(Gastos_variables_producto[[#This Row],[MES/PRODUCTO]]=\"\",\"\",SUM('6.GASTOS VARIABLES'!$C36:$O36))","v":""}]
[null,{"$f":"IF(Gastos_variables_producto[[#This Row],[MES/PRODUCTO]]=\"\",\"\",'ANEXO INGRESOS'!C26)","v":""},{"$f":"IF('ANEXO INGRESOS'!D26=\"\",\"\",'ANEXO INGRESOS'!D26)","v":""},{"$f":"IF('ANEXO INGRESOS'!$D26=\"\",\"\",'ANEXO INGRESOS'!H26*'ANEXO GASTOS VARIABLES'!$K$17)","v":""},{"$f":"IF('ANEXO INGRESOS'!$D26=\"\",\"\",'ANEXO INGRESOS'!I26*'ANEXO GASTOS VARIABLES'!$K$17)","v":""},{"$f":"IF('ANEXO INGRESOS'!$D26=\"\",\"\",'ANEXO INGRESOS'!J26*'ANEXO GASTOS VARIABLES'!$K$17)","v":""},{"$f":"IF('ANEXO INGRESOS'!$D26=\"\",\"\",'ANEXO INGRESOS'!K26*'ANEXO GASTOS VARIABLES'!$K$17)","v":""},{"$f":"IF('ANEXO INGRESOS'!$D26=\"\",\"\",'ANEXO INGRESOS'!L26*'ANEXO GASTOS VARIABLES'!$K$17)","v":""},{"$f":"IF('ANEXO INGRESOS'!$D26=\"\",\"\",'ANEXO INGRESOS'!M26*'ANEXO GASTOS VARIABLES'!$K$17)","v":""},{"$f":"IF('ANEXO INGRESOS'!$D26=\"\",\"\",'ANEXO INGRESOS'!N26*'ANEXO GASTOS VARIABLES'!$K$17)","v":""},{"$f":"IF('ANEXO INGRESOS'!$D26=\"\",\"\",'ANEXO INGRESOS'!O26*'ANEXO GASTOS VARIABLES'!$K$17)","v":""},{"$f":"IF('ANEXO INGRESOS'!$D26=\"\",\"\",'ANEXO INGRESOS'!P26*'ANEXO GASTOS VARIABLES'!$K$17)","v":""},{"$f":"IF('ANEXO INGRESOS'!$D26=\"\",\"\",'ANEXO INGRESOS'!Q26*'ANEXO GASTOS VARIABLES'!$K$17)","v":""},{"$f":"IF('ANEXO INGRESOS'!$D26=\"\",\"\",'ANEXO INGRESOS'!R26*'ANEXO GASTOS VARIABLES'!$K$17)","v":""},{"$f":"IF('ANEXO INGRESOS'!$D26=\"\",\"\",'ANEXO INGRESOS'!S26*'ANEXO GASTOS VARIABLES'!$K$17)","v":""},{"$f":"IF(Gastos_variables_producto[[#This Row],[MES/PRODUCTO]]=\"\",\"\",SUM('6.GASTOS VARIABLES'!$C37:$O37))","v":""}]
[null,{"$f":"IF(Gastos_variables_producto[[#This Row],[MES/PRODUCTO]]=\"\",\"\",'ANEXO INGRESOS'!C27)","v":""},{"$f":"IF('ANEXO INGRESOS'!D27=\"\",\"\",'ANEXO INGRESOS'!D27)","v":""},{"$f":"IF('ANEXO INGRESOS'!$D27=\"\",\"\",'ANEXO INGRESOS'!H27*'ANEXO GASTOS VARIABLES'!$K$17)","v":""},{"$f":"IF('ANEXO INGRESOS'!$D27=\"\",\"\",'ANEXO INGRESOS'!I27*'ANEXO GASTOS VARIABLES'!$K$17)","v":""},{"$f":"IF('ANEXO INGRESOS'!$D27=\"\",\"\",'ANEXO INGRESOS'!J27*'ANEXO GASTOS VARIABLES'!$K$17)","v":""},{"$f":"IF('ANEXO INGRESOS'!$D27=\"\",\"\",'ANEXO INGRESOS'!K27*'ANEXO GASTOS VARIABLES'!$K$17)","v":""},{"$f":"IF('ANEXO INGRESOS'!$D27=\"\",\"\",'ANEXO INGRESOS'!L27*'ANEXO GASTOS VARIABLES'!$K$17)","v":""},{"$f":"IF('ANEXO INGRESOS'!$D27=\"\",\"\",'ANEXO INGRESOS'!M27*'ANEXO GASTOS VARIABLES'!$K$17)","v":""},{"$f":"IF('ANEXO INGRESOS'!$D27=\"\",\"\",'ANEXO INGRESOS'!N27*'ANEXO GASTOS VARIABLES'!$K$17)","v":""},{"$f":"IF('ANEXO INGRESOS'!$D27=\"\",\"\",'ANEXO INGRESOS'!O27*'ANEXO GASTOS VARIABLES'!$K$17)","v":""},{"$f":"IF('ANEXO INGRESOS'!$D27=\"\",\"\",'ANEXO INGRESOS'!P27*'ANEXO GASTOS VARIABLES'!$K$17)","v":""},{"$f":"IF('ANEXO INGRESOS'!$D27=\"\",\"\",'ANEXO INGRESOS'!Q27*'ANEXO GASTOS VARIABLES'!$K$17)","v":""},{"$f":"IF('ANEXO INGRESOS'!$D27=\"\",\"\",'ANEXO INGRESOS'!R27*'ANEXO GASTOS VARIABLES'!$K$17)","v":""},{"$f":"IF('ANEXO INGRESOS'!$D27=\"\",\"\",'ANEXO INGRESOS'!S27*'ANEXO GASTOS VARIABLES'!$K$17)","v":""},{"$f":"IF(Gastos_variables_producto[[#This Row],[MES/PRODUCTO]]=\"\",\"\",SUM('6.GASTOS VARIABLES'!$C38:$O38))","v":""}]
[null,{"$f":"IF(Gastos_variables_producto[[#This Row],[MES/PRODUCTO]]=\"\",\"\",'ANEXO INGRESOS'!C28)","v":""},{"$f":"IF('ANEXO INGRESOS'!D28=\"\",\"\",'ANEXO INGRESOS'!D28)","v":""},{"$f":"IF('ANEXO INGRESOS'!$D28=\"\",\"\",'ANEXO INGRESOS'!H28*'ANEXO GASTOS VARIABLES'!$K$17)","v":""},{"$f":"IF('ANEXO INGRESOS'!$D28=\"\",\"\",'ANEXO INGRESOS'!I28*'ANEXO GASTOS VARIABLES'!$K$17)","v":""},{"$f":"IF('ANEXO INGRESOS'!$D28=\"\",\"\",'ANEXO INGRESOS'!J28*'ANEXO GASTOS VARIABLES'!$K$17)","v":""},{"$f":"IF('ANEXO INGRESOS'!$D28=\"\",\"\",'ANEXO INGRESOS'!K28*'ANEXO GASTOS VARIABLES'!$K$17)","v":""},{"$f":"IF('ANEXO INGRESOS'!$D28=\"\",\"\",'ANEXO INGRESOS'!L28*'ANEXO GASTOS VARIABLES'!$K$17)","v":""},{"$f":"IF('ANEXO INGRESOS'!$D28=\"\",\"\",'ANEXO INGRESOS'!M28*'ANEXO GASTOS VARIABLES'!$K$17)","v":""},{"$f":"IF('ANEXO INGRESOS'!$D28=\"\",\"\",'ANEXO INGRESOS'!N28*'ANEXO GASTOS VARIABLES'!$K$17)","v":""},{"$f":"IF('ANEXO INGRESOS'!$D28=\"\",\"\",'ANEXO INGRESOS'!O28*'ANEXO GASTOS VARIABLES'!$K$17)","v":""},{"$f":"IF('ANEXO INGRESOS'!$D28=\"\",\"\",'ANEXO INGRESOS'!P28*'ANEXO GASTOS VARIABLES'!$K$17)","v":""},{"$f":"IF('ANEXO INGRESOS'!$D28=\"\",\"\",'ANEXO INGRESOS'!Q28*'ANEXO GASTOS VARIABLES'!$K$17)","v":""},{"$f":"IF('ANEXO INGRESOS'!$D28=\"\",\"\",'ANEXO INGRESOS'!R28*'ANEXO GASTOS VARIABLES'!$K$17)","v":""},{"$f":"IF('ANEXO INGRESOS'!$D28=\"\",\"\",'ANEXO INGRESOS'!S28*'ANEXO GASTOS VARIABLES'!$K$17)","v":""},{"$f":"IF(Gastos_variables_producto[[#This Row],[MES/PRODUCTO]]=\"\",\"\",SUM('6.GASTOS VARIABLES'!$C39:$O39))","v":""}]
[null,{"$f":"IF(Gastos_variables_producto[[#This Row],[MES/PRODUCTO]]=\"\",\"\",'ANEXO INGRESOS'!C29)","v":""},{"$f":"IF('ANEXO INGRESOS'!D29=\"\",\"\",'ANEXO INGRESOS'!D29)","v":""},{"$f":"IF('ANEXO INGRESOS'!$D29=\"\",\"\",'ANEXO INGRESOS'!H29*'ANEXO GASTOS VARIABLES'!$K$17)","v":""},{"$f":"IF('ANEXO INGRESOS'!$D29=\"\",\"\",'ANEXO INGRESOS'!I29*'ANEXO GASTOS VARIABLES'!$K$17)","v":""},{"$f":"IF('ANEXO INGRESOS'!$D29=\"\",\"\",'ANEXO INGRESOS'!J29*'ANEXO GASTOS VARIABLES'!$K$17)","v":""},{"$f":"IF('ANEXO INGRESOS'!$D29=\"\",\"\",'ANEXO INGRESOS'!K29*'ANEXO GASTOS VARIABLES'!$K$17)","v":""},{"$f":"IF('ANEXO INGRESOS'!$D29=\"\",\"\",'ANEXO INGRESOS'!L29*'ANEXO GASTOS VARIABLES'!$K$17)","v":""},{"$f":"IF('ANEXO INGRESOS'!$D29=\"\",\"\",'ANEXO INGRESOS'!M29*'ANEXO GASTOS VARIABLES'!$K$17)","v":""},{"$f":"IF('ANEXO INGRESOS'!$D29=\"\",\"\",'ANEXO INGRESOS'!N29*'ANEXO GASTOS VARIABLES'!$K$17)","v":""},{"$f":"IF('ANEXO INGRESOS'!$D29=\"\",\"\",'ANEXO INGRESOS'!O29*'ANEXO GASTOS VARIABLES'!$K$17)","v":""},{"$f":"IF('ANEXO INGRESOS'!$D29=\"\",\"\",'ANEXO INGRESOS'!P29*'ANEXO GASTOS VARIABLES'!$K$17)","v":""},{"$f":"IF('ANEXO INGRESOS'!$D29=\"\",\"\",'ANEXO INGRESOS'!Q29*'ANEXO GASTOS VARIABLES'!$K$17)","v":""},{"$f":"IF('ANEXO INGRESOS'!$D29=\"\",\"\",'ANEXO INGRESOS'!R29*'ANEXO GASTOS VARIABLES'!$K$17)","v":""},{"$f":"IF('ANEXO INGRESOS'!$D29=\"\",\"\",'ANEXO INGRESOS'!S29*'ANEXO GASTOS VARIABLES'!$K$17)","v":""},{"$f":"IF(Gastos_variables_producto[[#This Row],[MES/PRODUCTO]]=\"\",\"\",SUM('6.GASTOS VARIABLES'!$C40:$O40))","v":""}]
[null,{"$f":"IF(Gastos_variables_producto[[#This Row],[MES/PRODUCTO]]=\"\",\"\",'ANEXO INGRESOS'!C30)","v":""},{"$f":"IF('ANEXO INGRESOS'!D30=\"\",\"\",'ANEXO INGRESOS'!D30)","v":""},{"$f":"IF('ANEXO INGRESOS'!$D30=\"\",\"\",'ANEXO INGRESOS'!H30*'ANEXO GASTOS VARIABLES'!$K$17)","v":""},{"$f":"IF('ANEXO INGRESOS'!$D30=\"\",\"\",'ANEXO INGRESOS'!I30*'ANEXO GASTOS VARIABLES'!$K$17)","v":""},{"$f":"IF('ANEXO INGRESOS'!$D30=\"\",\"\",'ANEXO INGRESOS'!J30*'ANEXO GASTOS VARIABLES'!$K$17)","v":""},{"$f":"IF('ANEXO INGRESOS'!$D30=\"\",\"\",'ANEXO INGRESOS'!K30*'ANEXO GASTOS VARIABLES'!$K$17)","v":""},{"$f":"IF('ANEXO INGRESOS'!$D30=\"\",\"\",'ANEXO INGRESOS'!L30*'ANEXO GASTOS VARIABLES'!$K$17)","v":""},{"$f":"IF('ANEXO INGRESOS'!$D30=\"\",\"\",'ANEXO INGRESOS'!M30*'ANEXO GASTOS VARIABLES'!$K$17)","v":""},{"$f":"IF('ANEXO INGRESOS'!$D30=\"\",\"\",'ANEXO INGRESOS'!N30*'ANEXO GASTOS VARIABLES'!$K$17)","v":""},{"$f":"IF('ANEXO INGRESOS'!$D30=\"\",\"\",'ANEXO INGRESOS'!O30*'ANEXO GASTOS VARIABLES'!$K$17)","v":""},{"$f":"IF('ANEXO INGRESOS'!$D30=\"\",\"\",'ANEXO INGRESOS'!P30*'ANEXO GASTOS VARIABLES'!$K$17)","v":""},{"$f":"IF('ANEXO INGRESOS'!$D30=\"\",\"\",'ANEXO INGRESOS'!Q30*'ANEXO GASTOS VARIABLES'!$K$17)","v":""},{"$f":"IF('ANEXO INGRESOS'!$D30=\"\",\"\",'ANEXO INGRESOS'!R30*'ANEXO GASTOS VARIABLES'!$K$17)","v":""},{"$f":"IF('ANEXO INGRESOS'!$D30=\"\",\"\",'ANEXO INGRESOS'!S30*'ANEXO GASTOS VARIABLES'!$K$17)","v":""},{"$f":"IF(Gastos_variables_producto[[#This Row],[MES/PRODUCTO]]=\"\",\"\",SUM('6.GASTOS VARIABLES'!$C41:$O41))","v":""}]
[null,{"$f":"IF(Gastos_variables_producto[[#This Row],[MES/PRODUCTO]]=\"\",\"\",'ANEXO INGRESOS'!C31)","v":""},{"$f":"IF('ANEXO INGRESOS'!D31=\"\",\"\",'ANEXO INGRESOS'!D31)","v":""},{"$f":"IF('ANEXO INGRESOS'!$D31=\"\",\"\",'ANEXO INGRESOS'!H31*'ANEXO GASTOS VARIABLES'!$K$17)","v":""},{"$f":"IF('ANEXO INGRESOS'!$D31=\"\",\"\",'ANEXO INGRESOS'!I31*'ANEXO GASTOS VARIABLES'!$K$17)","v":""},{"$f":"IF('ANEXO INGRESOS'!$D31=\"\",\"\",'ANEXO INGRESOS'!J31*'ANEXO GASTOS VARIABLES'!$K$17)","v":""},{"$f":"IF('ANEXO INGRESOS'!$D31=\"\",\"\",'ANEXO INGRESOS'!K31*'ANEXO GASTOS VARIABLES'!$K$17)","v":""},{"$f":"IF('ANEXO INGRESOS'!$D31=\"\",\"\",'ANEXO INGRESOS'!L31*'ANEXO GASTOS VARIABLES'!$K$17)","v":""},{"$f":"IF('ANEXO INGRESOS'!$D31=\"\",\"\",'ANEXO INGRESOS'!M31*'ANEXO GASTOS VARIABLES'!$K$17)","v":""},{"$f":"IF('ANEXO INGRESOS'!$D31=\"\",\"\",'ANEXO INGRESOS'!N31*'ANEXO GASTOS VARIABLES'!$K$17)","v":""},{"$f":"IF('ANEXO INGRESOS'!$D31=\"\",\"\",'ANEXO INGRESOS'!O31*'ANEXO GASTOS VARIABLES'!$K$17)","v":""},{"$f":"IF('ANEXO INGRESOS'!$D31=\"\",\"\",'ANEXO INGRESOS'!P31*'ANEXO GASTOS VARIABLES'!$K$17)","v":""},{"$f":"IF('ANEXO INGRESOS'!$D31=\"\",\"\",'ANEXO INGRESOS'!Q31*'ANEXO GASTOS VARIABLES'!$K$17)","v":""},{"$f":"IF('ANEXO INGRESOS'!$D31=\"\",\"\",'ANEXO INGRESOS'!R31*'ANEXO GASTOS VARIABLES'!$K$17)","v":""},{"$f":"IF('ANEXO INGRESOS'!$D31=\"\",\"\",'ANEXO INGRESOS'!S31*'ANEXO GASTOS VARIABLES'!$K$17)","v":""},{"$f":"IF(Gastos_variables_producto[[#This Row],[MES/PRODUCTO]]=\"\",\"\",SUM('6.GASTOS VARIABLES'!$C42:$O42))","v":""}]
[null,{"$f":"IF(Gastos_variables_producto[[#This Row],[MES/PRODUCTO]]=\"\",\"\",'ANEXO INGRESOS'!C32)","v":""},{"$f":"IF('ANEXO INGRESOS'!D32=\"\",\"\",'ANEXO INGRESOS'!D32)","v":""},{"$f":"IF('ANEXO INGRESOS'!$D32=\"\",\"\",'ANEXO INGRESOS'!H32*'ANEXO GASTOS VARIABLES'!$K$17)","v":""},{"$f":"IF('ANEXO INGRESOS'!$D32=\"\",\"\",'ANEXO INGRESOS'!I32*'ANEXO GASTOS VARIABLES'!$K$17)","v":""},{"$f":"IF('ANEXO INGRESOS'!$D32=\"\",\"\",'ANEXO INGRESOS'!J32*'ANEXO GASTOS VARIABLES'!$K$17)","v":""},{"$f":"IF('ANEXO INGRESOS'!$D32=\"\",\"\",'ANEXO INGRESOS'!K32*'ANEXO GASTOS VARIABLES'!$K$17)","v":""},{"$f":"IF('ANEXO INGRESOS'!$D32=\"\",\"\",'ANEXO INGRESOS'!L32*'ANEXO GASTOS VARIABLES'!$K$17)","v":""},{"$f":"IF('ANEXO INGRESOS'!$D32=\"\",\"\",'ANEXO INGRESOS'!M32*'ANEXO GASTOS VARIABLES'!$K$17)","v":""},{"$f":"IF('ANEXO INGRESOS'!$D32=\"\",\"\",'ANEXO INGRESOS'!N32*'ANEXO GASTOS VARIABLES'!$K$17)","v":""},{"$f":"IF('ANEXO INGRESOS'!$D32=\"\",\"\",'ANEXO INGRESOS'!O32*'ANEXO GASTOS VARIABLES'!$K$17)","v":""},{"$f":"IF('ANEXO INGRESOS'!$D32=\"\",\"\",'ANEXO INGRESOS'!P32*'ANEXO GASTOS VARIABLES'!$K$17)","v":""},{"$f":"IF('ANEXO INGRESOS'!$D32=\"\",\"\",'ANEXO INGRESOS'!Q32*'ANEXO GASTOS VARIABLES'!$K$17)","v":""},{"$f":"IF('ANEXO INGRESOS'!$D32=\"\",\"\",'ANEXO INGRESOS'!R32*'ANEXO GASTOS VARIABLES'!$K$17)","v":""},{"$f":"IF('ANEXO INGRESOS'!$D32=\"\",\"\",'ANEXO INGRESOS'!S32*'ANEXO GASTOS VARIABLES'!$K$17)","v":""},{"$f":"IF(Gastos_variables_producto[[#This Row],[MES/PRODUCTO]]=\"\",\"\",SUM('6.GASTOS VARIABLES'!$C43:$O43))","v":""}]
[null,{"$f":"IF(Gastos_variables_producto[[#This Row],[MES/PRODUCTO]]=\"\",\"\",'ANEXO INGRESOS'!C33)","v":""},{"$f":"IF('ANEXO INGRESOS'!D33=\"\",\"\",'ANEXO INGRESOS'!D33)","v":""},{"$f":"IF('ANEXO INGRESOS'!$D33=\"\",\"\",'ANEXO INGRESOS'!H33*'ANEXO GASTOS VARIABLES'!$K$17)","v":""},{"$f":"IF('ANEXO INGRESOS'!$D33=\"\",\"\",'ANEXO INGRESOS'!I33*'ANEXO GASTOS VARIABLES'!$K$17)","v":""},{"$f":"IF('ANEXO INGRESOS'!$D33=\"\",\"\",'ANEXO INGRESOS'!J33*'ANEXO GASTOS VARIABLES'!$K$17)","v":""},{"$f":"IF('ANEXO INGRESOS'!$D33=\"\",\"\",'ANEXO INGRESOS'!K33*'ANEXO GASTOS VARIABLES'!$K$17)","v":""},{"$f":"IF('ANEXO INGRESOS'!$D33=\"\",\"\",'ANEXO INGRESOS'!L33*'ANEXO GASTOS VARIABLES'!$K$17)","v":""},{"$f":"IF('ANEXO INGRESOS'!$D33=\"\",\"\",'ANEXO INGRESOS'!M33*'ANEXO GASTOS VARIABLES'!$K$17)","v":""},{"$f":"IF('ANEXO INGRESOS'!$D33=\"\",\"\",'ANEXO INGRESOS'!N33*'ANEXO GASTOS VARIABLES'!$K$17)","v":""},{"$f":"IF('ANEXO INGRESOS'!$D33=\"\",\"\",'ANEXO INGRESOS'!O33*'ANEXO GASTOS VARIABLES'!$K$17)","v":""},{"$f":"IF('ANEXO INGRESOS'!$D33=\"\",\"\",'ANEXO INGRESOS'!P33*'ANEXO GASTOS VARIABLES'!$K$17)","v":""},{"$f":"IF('ANEXO INGRESOS'!$D33=\"\",\"\",'ANEXO INGRESOS'!Q33*'ANEXO GASTOS VARIABLES'!$K$17)","v":""},{"$f":"IF('ANEXO INGRESOS'!$D33=\"\",\"\",'ANEXO INGRESOS'!R33*'ANEXO GASTOS VARIABLES'!$K$17)","v":""},{"$f":"IF('ANEXO INGRESOS'!$D33=\"\",\"\",'ANEXO INGRESOS'!S33*'ANEXO GASTOS VARIABLES'!$K$17)","v":""},{"$f":"IF(Gastos_variables_producto[[#This Row],[MES/PRODUCTO]]=\"\",\"\",SUM('6.GASTOS VARIABLES'!$C44:$O44))","v":""}]
[null,{"$f":"IF(Gastos_variables_producto[[#This Row],[MES/PRODUCTO]]=\"\",\"\",'ANEXO INGRESOS'!C34)","v":""},{"$f":"IF('ANEXO INGRESOS'!D34=\"\",\"\",'ANEXO INGRESOS'!D34)","v":""},{"$f":"IF('ANEXO INGRESOS'!$D34=\"\",\"\",'ANEXO INGRESOS'!H34*'ANEXO GASTOS VARIABLES'!$K$17)","v":""},{"$f":"IF('ANEXO INGRESOS'!$D34=\"\",\"\",'ANEXO INGRESOS'!I34*'ANEXO GASTOS VARIABLES'!$K$17)","v":""},{"$f":"IF('ANEXO INGRESOS'!$D34=\"\",\"\",'ANEXO INGRESOS'!J34*'ANEXO GASTOS VARIABLES'!$K$17)","v":""},{"$f":"IF('ANEXO INGRESOS'!$D34=\"\",\"\",'ANEXO INGRESOS'!K34*'ANEXO GASTOS VARIABLES'!$K$17)","v":""},{"$f":"IF('ANEXO INGRESOS'!$D34=\"\",\"\",'ANEXO INGRESOS'!L34*'ANEXO GASTOS VARIABLES'!$K$17)","v":""},{"$f":"IF('ANEXO INGRESOS'!$D34=\"\",\"\",'ANEXO INGRESOS'!M34*'ANEXO GASTOS VARIABLES'!$K$17)","v":""},{"$f":"IF('ANEXO INGRESOS'!$D34=\"\",\"\",'ANEXO INGRESOS'!N34*'ANEXO GASTOS VARIABLES'!$K$17)","v":""},{"$f":"IF('ANEXO INGRESOS'!$D34=\"\",\"\",'ANEXO INGRESOS'!O34*'ANEXO GASTOS VARIABLES'!$K$17)","v":""},{"$f":"IF('ANEXO INGRESOS'!$D34=\"\",\"\",'ANEXO INGRESOS'!P34*'ANEXO GASTOS VARIABLES'!$K$17)","v":""},{"$f":"IF('ANEXO INGRESOS'!$D34=\"\",\"\",'ANEXO INGRESOS'!Q34*'ANEXO GASTOS VARIABLES'!$K$17)","v":""},{"$f":"IF('ANEXO INGRESOS'!$D34=\"\",\"\",'ANEXO INGRESOS'!R34*'ANEXO GASTOS VARIABLES'!$K$17)","v":""},{"$f":"IF('ANEXO INGRESOS'!$D34=\"\",\"\",'ANEXO INGRESOS'!S34*'ANEXO GASTOS VARIABLES'!$K$17)","v":""},{"$f":"IF(Gastos_variables_producto[[#This Row],[MES/PRODUCTO]]=\"\",\"\",SUM('6.GASTOS VARIABLES'!$C45:$O45))","v":""}]
[null,{"$f":"IF(Gastos_variables_producto[[#This Row],[MES/PRODUCTO]]=\"\",\"\",'ANEXO INGRESOS'!C35)","v":""},{"$f":"IF('ANEXO INGRESOS'!D35=\"\",\"\",'ANEXO INGRESOS'!D35)","v":""},{"$f":"IF('ANEXO INGRESOS'!$D35=\"\",\"\",'ANEXO INGRESOS'!H35*'ANEXO GASTOS VARIABLES'!$K$17)","v":""},{"$f":"IF('ANEXO INGRESOS'!$D35=\"\",\"\",'ANEXO INGRESOS'!I35*'ANEXO GASTOS VARIABLES'!$K$17)","v":""},{"$f":"IF('ANEXO INGRESOS'!$D35=\"\",\"\",'ANEXO INGRESOS'!J35*'ANEXO GASTOS VARIABLES'!$K$17)","v":""},{"$f":"IF('ANEXO INGRESOS'!$D35=\"\",\"\",'ANEXO INGRESOS'!K35*'ANEXO GASTOS VARIABLES'!$K$17)","v":""},{"$f":"IF('ANEXO INGRESOS'!$D35=\"\",\"\",'ANEXO INGRESOS'!L35*'ANEXO GASTOS VARIABLES'!$K$17)","v":""},{"$f":"IF('ANEXO INGRESOS'!$D35=\"\",\"\",'ANEXO INGRESOS'!M35*'ANEXO GASTOS VARIABLES'!$K$17)","v":""},{"$f":"IF('ANEXO INGRESOS'!$D35=\"\",\"\",'ANEXO INGRESOS'!N35*'ANEXO GASTOS VARIABLES'!$K$17)","v":""},{"$f":"IF('ANEXO INGRESOS'!$D35=\"\",\"\",'ANEXO INGRESOS'!O35*'ANEXO GASTOS VARIABLES'!$K$17)","v":""},{"$f":"IF('ANEXO INGRESOS'!$D35=\"\",\"\",'ANEXO INGRESOS'!P35*'ANEXO GASTOS VARIABLES'!$K$17)","v":""},{"$f":"IF('ANEXO INGRESOS'!$D35=\"\",\"\",'ANEXO INGRESOS'!Q35*'ANEXO GASTOS VARIABLES'!$K$17)","v":""},{"$f":"IF('ANEXO INGRESOS'!$D35=\"\",\"\",'ANEXO INGRESOS'!R35*'ANEXO GASTOS VARIABLES'!$K$17)","v":""},{"$f":"IF('ANEXO INGRESOS'!$D35=\"\",\"\",'ANEXO INGRESOS'!S35*'ANEXO GASTOS VARIABLES'!$K$17)","v":""},{"$f":"IF(Gastos_variables_producto[[#This Row],[MES/PRODUCTO]]=\"\",\"\",SUM('6.GASTOS VARIABLES'!$C46:$O46))","v":""}]
[null,{"$f":"IF(Gastos_variables_producto[[#This Row],[MES/PRODUCTO]]=\"\",\"\",'ANEXO INGRESOS'!C36)","v":""},{"$f":"IF('ANEXO INGRESOS'!D36=\"\",\"\",'ANEXO INGRESOS'!D36)","v":""},{"$f":"IF('ANEXO INGRESOS'!$D36=\"\",\"\",'ANEXO INGRESOS'!H36*'ANEXO GASTOS VARIABLES'!$K$17)","v":""},{"$f":"IF('ANEXO INGRESOS'!$D36=\"\",\"\",'ANEXO INGRESOS'!I36*'ANEXO GASTOS VARIABLES'!$K$17)","v":""},{"$f":"IF('ANEXO INGRESOS'!$D36=\"\",\"\",'ANEXO INGRESOS'!J36*'ANEXO GASTOS VARIABLES'!$K$17)","v":""},{"$f":"IF('ANEXO INGRESOS'!$D36=\"\",\"\",'ANEXO INGRESOS'!K36*'ANEXO GASTOS VARIABLES'!$K$17)","v":""},{"$f":"IF('ANEXO INGRESOS'!$D36=\"\",\"\",'ANEXO INGRESOS'!L36*'ANEXO GASTOS VARIABLES'!$K$17)","v":""},{"$f":"IF('ANEXO INGRESOS'!$D36=\"\",\"\",'ANEXO INGRESOS'!M36*'ANEXO GASTOS VARIABLES'!$K$17)","v":""},{"$f":"IF('ANEXO INGRESOS'!$D36=\"\",\"\",'ANEXO INGRESOS'!N36*'ANEXO GASTOS VARIABLES'!$K$17)","v":""},{"$f":"IF('ANEXO INGRESOS'!$D36=\"\",\"\",'ANEXO INGRESOS'!O36*'ANEXO GASTOS VARIABLES'!$K$17)","v":""},{"$f":"IF('ANEXO INGRESOS'!$D36=\"\",\"\",'ANEXO INGRESOS'!P36*'ANEXO GASTOS VARIABLES'!$K$17)","v":""},{"$f":"IF('ANEXO INGRESOS'!$D36=\"\",\"\",'ANEXO INGRESOS'!Q36*'ANEXO GASTOS VARIABLES'!$K$17)","v":""},{"$f":"IF('ANEXO INGRESOS'!$D36=\"\",\"\",'ANEXO INGRESOS'!R36*'ANEXO GASTOS VARIABLES'!$K$17)","v":""},{"$f":"IF('ANEXO INGRESOS'!$D36=\"\",\"\",'ANEXO INGRESOS'!S36*'ANEXO GASTOS VARIABLES'!$K$17)","v":""},{"$f":"IF(Gastos_variables_producto[[#This Row],[MES/PRODUCTO]]=\"\",\"\",SUM('6.GASTOS VARIABLES'!$C47:$O47))","v":""}]
[null,{"$f":"IF(Gastos_variables_producto[[#This Row],[MES/PRODUCTO]]=\"\",\"\",'ANEXO INGRESOS'!C37)","v":""},{"$f":"IF('ANEXO INGRESOS'!D37=\"\",\"\",'ANEXO INGRESOS'!D37)","v":""},{"$f":"IF('ANEXO INGRESOS'!$D37=\"\",\"\",'ANEXO INGRESOS'!H37*'ANEXO GASTOS VARIABLES'!$K$17)","v":""},{"$f":"IF('ANEXO INGRESOS'!$D37=\"\",\"\",'ANEXO INGRESOS'!I37*'ANEXO GASTOS VARIABLES'!$K$17)","v":""},{"$f":"IF('ANEXO INGRESOS'!$D37=\"\",\"\",'ANEXO INGRESOS'!J37*'ANEXO GASTOS VARIABLES'!$K$17)","v":""},{"$f":"IF('ANEXO INGRESOS'!$D37=\"\",\"\",'ANEXO INGRESOS'!K37*'ANEXO GASTOS VARIABLES'!$K$17)","v":""},{"$f":"IF('ANEXO INGRESOS'!$D37=\"\",\"\",'ANEXO INGRESOS'!L37*'ANEXO GASTOS VARIABLES'!$K$17)","v":""},{"$f":"IF('ANEXO INGRESOS'!$D37=\"\",\"\",'ANEXO INGRESOS'!M37*'ANEXO GASTOS VARIABLES'!$K$17)","v":""},{"$f":"IF('ANEXO INGRESOS'!$D37=\"\",\"\",'ANEXO INGRESOS'!N37*'ANEXO GASTOS VARIABLES'!$K$17)","v":""},{"$f":"IF('ANEXO INGRESOS'!$D37=\"\",\"\",'ANEXO INGRESOS'!O37*'ANEXO GASTOS VARIABLES'!$K$17)","v":""},{"$f":"IF('ANEXO INGRESOS'!$D37=\"\",\"\",'ANEXO INGRESOS'!P37*'ANEXO GASTOS VARIABLES'!$K$17)","v":""},{"$f":"IF('ANEXO INGRESOS'!$D37=\"\",\"\",'ANEXO INGRESOS'!Q37*'ANEXO GASTOS VARIABLES'!$K$17)","v":""},{"$f":"IF('ANEXO INGRESOS'!$D37=\"\",\"\",'ANEXO INGRESOS'!R37*'ANEXO GASTOS VARIABLES'!$K$17)","v":""},{"$f":"IF('ANEXO INGRESOS'!$D37=\"\",\"\",'ANEXO INGRESOS'!S37*'ANEXO GASTOS VARIABLES'!$K$17)","v":""},{"$f":"IF(Gastos_variables_producto[[#This Row],[MES/PRODUCTO]]=\"\",\"\",SUM('6.GASTOS VARIABLES'!$C48:$O48))","v":""}]
[null,{"$f":"IF(Gastos_variables_producto[[#This Row],[MES/PRODUCTO]]=\"\",\"\",'ANEXO INGRESOS'!C38)","v":""},{"$f":"IF('ANEXO INGRESOS'!D38=\"\",\"\",'ANEXO INGRESOS'!D38)","v":""},{"$f":"IF('ANEXO INGRESOS'!$D38=\"\",\"\",'ANEXO INGRESOS'!H38*'ANEXO GASTOS VARIABLES'!$K$17)","v":""},{"$f":"IF('ANEXO INGRESOS'!$D38=\"\",\"\",'ANEXO INGRESOS'!I38*'ANEXO GASTOS VARIABLES'!$K$17)","v":""},{"$f":"IF('ANEXO INGRESOS'!$D38=\"\",\"\",'ANEXO INGRESOS'!J38*'ANEXO GASTOS VARIABLES'!$K$17)","v":""},{"$f":"IF('ANEXO INGRESOS'!$D38=\"\",\"\",'ANEXO INGRESOS'!K38*'ANEXO GASTOS VARIABLES'!$K$17)","v":""},{"$f":"IF('ANEXO INGRESOS'!$D38=\"\",\"\",'ANEXO INGRESOS'!L38*'ANEXO GASTOS VARIABLES'!$K$17)","v":""},{"$f":"IF('ANEXO INGRESOS'!$D38=\"\",\"\",'ANEXO INGRESOS'!M38*'ANEXO GASTOS VARIABLES'!$K$17)","v":""},{"$f":"IF('ANEXO INGRESOS'!$D38=\"\",\"\",'ANEXO INGRESOS'!N38*'ANEXO GASTOS VARIABLES'!$K$17)","v":""},{"$f":"IF('ANEXO INGRESOS'!$D38=\"\",\"\",'ANEXO INGRESOS'!O38*'ANEXO GASTOS VARIABLES'!$K$17)","v":""},{"$f":"IF('ANEXO INGRESOS'!$D38=\"\",\"\",'ANEXO INGRESOS'!P38*'ANEXO GASTOS VARIABLES'!$K$17)","v":""},{"$f":"IF('ANEXO INGRESOS'!$D38=\"\",\"\",'ANEXO INGRESOS'!Q38*'ANEXO GASTOS VARIABLES'!$K$17)","v":""},{"$f":"IF('ANEXO INGRESOS'!$D38=\"\",\"\",'ANEXO INGRESOS'!R38*'ANEXO GASTOS VARIABLES'!$K$17)","v":""},{"$f":"IF('ANEXO INGRESOS'!$D38=\"\",\"\",'ANEXO INGRESOS'!S38*'ANEXO GASTOS VARIABLES'!$K$17)","v":""},{"$f":"IF(Gastos_variables_producto[[#This Row],[MES/PRODUCTO]]=\"\",\"\",SUM('6.GASTOS VARIABLES'!$C49:$O49))","v":""}]
[null,{"$f":"IF(Gastos_variables_producto[[#This Row],[MES/PRODUCTO]]=\"\",\"\",'ANEXO INGRESOS'!C39)","v":""},{"$f":"IF('ANEXO INGRESOS'!D39=\"\",\"\",'ANEXO INGRESOS'!D39)","v":""},{"$f":"IF('ANEXO INGRESOS'!$D39=\"\",\"\",'ANEXO INGRESOS'!H39*'ANEXO GASTOS VARIABLES'!$K$17)","v":""},{"$f":"IF('ANEXO INGRESOS'!$D39=\"\",\"\",'ANEXO INGRESOS'!I39*'ANEXO GASTOS VARIABLES'!$K$17)","v":""},{"$f":"IF('ANEXO INGRESOS'!$D39=\"\",\"\",'ANEXO INGRESOS'!J39*'ANEXO GASTOS VARIABLES'!$K$17)","v":""},{"$f":"IF('ANEXO INGRESOS'!$D39=\"\",\"\",'ANEXO INGRESOS'!K39*'ANEXO GASTOS VARIABLES'!$K$17)","v":""},{"$f":"IF('ANEXO INGRESOS'!$D39=\"\",\"\",'ANEXO INGRESOS'!L39*'ANEXO GASTOS VARIABLES'!$K$17)","v":""},{"$f":"IF('ANEXO INGRESOS'!$D39=\"\",\"\",'ANEXO INGRESOS'!M39*'ANEXO GASTOS VARIABLES'!$K$17)","v":""},{"$f":"IF('ANEXO INGRESOS'!$D39=\"\",\"\",'ANEXO INGRESOS'!N39*'ANEXO GASTOS VARIABLES'!$K$17)","v":""},{"$f":"IF('ANEXO INGRESOS'!$D39=\"\",\"\",'ANEXO INGRESOS'!O39*'ANEXO GASTOS VARIABLES'!$K$17)","v":""},{"$f":"IF('ANEXO INGRESOS'!$D39=\"\",\"\",'ANEXO INGRESOS'!P39*'ANEXO GASTOS VARIABLES'!$K$17)","v":""},{"$f":"IF('ANEXO INGRESOS'!$D39=\"\",\"\",'ANEXO INGRESOS'!Q39*'ANEXO GASTOS VARIABLES'!$K$17)","v":""},{"$f":"IF('ANEXO INGRESOS'!$D39=\"\",\"\",'ANEXO INGRESOS'!R39*'ANEXO GASTOS VARIABLES'!$K$17)","v":""},{"$f":"IF('ANEXO INGRESOS'!$D39=\"\",\"\",'ANEXO INGRESOS'!S39*'ANEXO GASTOS VARIABLES'!$K$17)","v":""},{"$f":"IF(Gastos_variables_producto[[#This Row],[MES/PRODUCTO]]=\"\",\"\",SUM('6.GASTOS VARIABLES'!$C50:$O50))","v":""}]
[null,{"$f":"IF(Gastos_variables_producto[[#This Row],[MES/PRODUCTO]]=\"\",\"\",'ANEXO INGRESOS'!C40)","v":""},{"$f":"IF('ANEXO INGRESOS'!D40=\"\",\"\",'ANEXO INGRESOS'!D40)","v":""},{"$f":"IF('ANEXO INGRESOS'!$D40=\"\",\"\",'ANEXO INGRESOS'!H40*'ANEXO GASTOS VARIABLES'!$K$17)","v":""},{"$f":"IF('ANEXO INGRESOS'!$D40=\"\",\"\",'ANEXO INGRESOS'!I40*'ANEXO GASTOS VARIABLES'!$K$17)","v":""},{"$f":"IF('ANEXO INGRESOS'!$D40=\"\",\"\",'ANEXO INGRESOS'!J40*'ANEXO GASTOS VARIABLES'!$K$17)","v":""},{"$f":"IF('ANEXO INGRESOS'!$D40=\"\",\"\",'ANEXO INGRESOS'!K40*'ANEXO GASTOS VARIABLES'!$K$17)","v":""},{"$f":"IF('ANEXO INGRESOS'!$D40=\"\",\"\",'ANEXO INGRESOS'!L40*'ANEXO GASTOS VARIABLES'!$K$17)","v":""},{"$f":"IF('ANEXO INGRESOS'!$D40=\"\",\"\",'ANEXO INGRESOS'!M40*'ANEXO GASTOS VARIABLES'!$K$17)","v":""},{"$f":"IF('ANEXO INGRESOS'!$D40=\"\",\"\",'ANEXO INGRESOS'!N40*'ANEXO GASTOS VARIABLES'!$K$17)","v":""},{"$f":"IF('ANEXO INGRESOS'!$D40=\"\",\"\",'ANEXO INGRESOS'!O40*'ANEXO GASTOS VARIABLES'!$K$17)","v":""},{"$f":"IF('ANEXO INGRESOS'!$D40=\"\",\"\",'ANEXO INGRESOS'!P40*'ANEXO GASTOS VARIABLES'!$K$17)","v":""},{"$f":"IF('ANEXO INGRESOS'!$D40=\"\",\"\",'ANEXO INGRESOS'!Q40*'ANEXO GASTOS VARIABLES'!$K$17)","v":""},{"$f":"IF('ANEXO INGRESOS'!$D40=\"\",\"\",'ANEXO INGRESOS'!R40*'ANEXO GASTOS VARIABLES'!$K$17)","v":""},{"$f":"IF('ANEXO INGRESOS'!$D40=\"\",\"\",'ANEXO INGRESOS'!S40*'ANEXO GASTOS VARIABLES'!$K$17)","v":""},{"$f":"IF(Gastos_variables_producto[[#This Row],[MES/PRODUCTO]]=\"\",\"\",SUM('6.GASTOS VARIABLES'!$C51:$O51))","v":""}]
[null,null,"TOTAL",{"$f":"SUM('6.GASTOS VARIABLES'!$D$24:$D$51)","v":0},{"$f":"SUM('6.GASTOS VARIABLES'!$E$24:$E$51)","v":0},{"$f":"SUM('6.GASTOS VARIABLES'!$F$24:$F$51)","v":0},{"$f":"SUM('6.GASTOS VARIABLES'!$G$24:$G$51)","v":0},{"$f":"SUM('6.GASTOS VARIABLES'!$H$24:$H$51)","v":0},{"$f":"SUM('6.GASTOS VARIABLES'!$I$24:$I$51)","v":0},{"$f":"SUM('6.GASTOS VARIABLES'!$J$24:$J$51)","v":0},{"$f":"SUM('6.GASTOS VARIABLES'!$K$24:$K$51)","v":0},{"$f":"SUM('6.GASTOS VARIABLES'!$L$24:$L$51)","v":0},{"$f":"SUM('6.GASTOS VARIABLES'!$M$24:$M$51)","v":0},{"$f":"SUM('6.GASTOS VARIABLES'!$N$24:$N$51)","v":0},{"$f":"SUM('6.GASTOS VARIABLES'!$O$24:$O$51)","v":0},{"$f":"SUM('6.GASTOS VARIABLES'!$O$24:$O$51)","v":0}]
[]
[]
[]
[]
[null,null,null,null,null,null,null,null,null,null,null,null,null,null,null,null,null,null,null,null,null,null,null,null,null,null,null,null,null,null,null,null,null,null,null,null,null,null,null,null,null,null,null,null,null,null,null,null,null,null,null,null,null,null,null,null,null,null,null,null,null,null,null,null,null,null,null,null,null,null,null,"TOTAL AÑO 1 "]
[null,"IVA","MES/PRODUCTO","TOTAL AÑO 1 ","TOTAL AÑO 2 ","TOTAL AÑO 3 ","TOTAL AÑO 4 ",null,null,null,null,null,null,null,null,null,null,null,null,null,null,null,null,null,null,null,null,null,null,null,null,null,null,null,null,null,null,null,null,null,null,null,null,null,null,null,null,null,null,null,null,null,null,null,null,null,null,null,null,null,null,null,null,null,null,null,null,null,null,null,null,{"$f":"IF(Totales_años[[#This Row],[TOTAL AÑO 1 ]]<>\"\",Totales_años[[#This Row],[TOTAL AÑO 1 ]],NA())","v":{"$error":"#VALUE!"}}]
[null,{"$f":"IF(C59=\"\",\"\",'ANEXO INGRESOS'!C14)","v":""},{"$f":"IF('ANEXO INGRESOS'!D14=\"\",\"\",'ANEXO INGRESOS'!D14)","v":""},{"$f":"IF(Totales_años[[#This Row],[MES/PRODUCTO]]=\"\",\"\",P25)","v":""},{"$f":"IF(Totales_años[[#This Row],[TOTAL AÑO 1 ]]=\"\",\"\",Totales_años[[#This Row],[TOTAL AÑO 1 ]]*$E$19+Totales_años[[#This Row],[TOTAL AÑO 1 ]])","v":""},{"$f":"IF(Totales_años[[#This Row],[TOTAL AÑO 1 ]]=\"\",\"\",Totales_años[[#This Row],[TOTAL AÑO 2 ]]*$F$19+Totales_años[[#This Row],[TOTAL AÑO 2 ]])","v":""},{"$f":"IF(Totales_años[[#This Row],[TOTAL AÑO 1 ]]=\"\",\"\",Totales_años[[#This Row],[TOTAL AÑO 3 ]]*$G$19+Totales_años[[#This Row],[TOTAL AÑO 3 ]])","v":""},null,null,null,null,null,null,null,null,null,null,null,null,null,null,null,null,null,null,null,null,null,null,null,null,null,null,null,null,null,null,null,null,null,null,null,null,null,null,null,null,null,null,null,null,null,null,null,null,null,null,null,null,null,null,null,null,null,null,null,null,null,null,null,null,{"$f":"IF(Totales_años[[#This Row],[TOTAL AÑO 1 ]]<>\"\",Totales_años[[#This Row],[TOTAL AÑO 1 ]],NA())","v":{"$error":"#N/A"}}]
[null,{"$f":"IF(C60=\"\",\"\",'ANEXO INGRESOS'!C15)","v":""},{"$f":"IF('ANEXO INGRESOS'!D15=\"\",\"\",'ANEXO INGRESOS'!D15)","v":""},{"$f":"IF(Totales_años[[#This Row],[MES/PRODUCTO]]=\"\",\"\",P26)","v":""},{"$f":"IF(Totales_años[[#This Row],[TOTAL AÑO 1 ]]=\"\",\"\",Totales_años[[#This Row],[TOTAL AÑO 1 ]]*$E$19+Totales_años[[#This Row],[TOTAL AÑO 1 ]])","v":""},{"$f":"IF(Totales_años[[#This Row],[TOTAL AÑO 1 ]]=\"\",\"\",Totales_años[[#This Row],[TOTAL AÑO 2 ]]*$F$19+Totales_años[[#This Row],[TOTAL AÑO 2 ]])","v":""},{"$f":"IF(Totales_años[[#This Row],[TOTAL AÑO 1 ]]=\"\",\"\",Totales_años[[#This Row],[TOTAL AÑO 3 ]]*$G$19+Totales_años[[#This Row],[TOTAL AÑO 3 ]])","v":""},null,null,null,null,null,null,null,null,null,null,null,null,null,null,null,null,null,null,null,null,null,null,null,null,null,null,null,null,null,null,null,null,null,null,null,null,null,null,null,null,null,null,null,null,null,null,null,null,null,null,null,null,null,null,null,null,null,null,null,null,null,null,null,null,{"$f":"IF(Totales_años[[#This Row],[TOTAL AÑO 1 ]]<>\"\",Totales_años[[#This Row],[TOTAL AÑO 1 ]],NA())","v":{"$error":"#N/A"}}]
[null,{"$f":"IF(C61=\"\",\"\",'ANEXO INGRESOS'!C16)","v":""},{"$f":"IF('ANEXO INGRESOS'!D16=\"\",\"\",'ANEXO INGRESOS'!D16)","v":""},{"$f":"IF(Totales_años[[#This Row],[MES/PRODUCTO]]=\"\",\"\",P27)","v":""},{"$f":"IF(Totales_años[[#This Row],[TOTAL AÑO 1 ]]=\"\",\"\",Totales_años[[#This Row],[TOTAL AÑO 1 ]]*$E$19+Totales_años[[#This Row],[TOTAL AÑO 1 ]])","v":""},{"$f":"IF(Totales_años[[#This Row],[TOTAL AÑO 1 ]]=\"\",\"\",Totales_años[[#This Row],[TOTAL AÑO 2 ]]*$F$19+Totales_años[[#This Row],[TOTAL AÑO 2 ]])","v":""},{"$f":"IF(Totales_años[[#This Row],[TOTAL AÑO 1 ]]=\"\",\"\",Totales_años[[#This Row],[TOTAL AÑO 3 ]]*$G$19+Totales_años[[#This Row],[TOTAL AÑO 3 ]])","v":""},null,null,null,null,null,null,null,null,null,null,null,null,null,null,null,null,null,null,null,null,null,null,null,null,null,null,null,null,null,null,null,null,null,null,null,null,null,null,null,null,null,null,null,null,null,null,null,null,null,null,null,null,null,null,null,null,null,null,null,null,null,null,null,null,{"$f":"IF(Totales_años[[#This Row],[TOTAL AÑO 1 ]]<>\"\",Totales_años[[#This Row],[TOTAL AÑO 1 ]],NA())","v":{"$error":"#N/A"}}]
[null,{"$f":"IF(C62=\"\",\"\",'ANEXO INGRESOS'!C17)","v":""},{"$f":"IF('ANEXO INGRESOS'!D17=\"\",\"\",'ANEXO INGRESOS'!D17)","v":""},{"$f":"IF(Totales_años[[#This Row],[MES/PRODUCTO]]=\"\",\"\",P28)","v":""},{"$f":"IF(Totales_años[[#This Row],[TOTAL AÑO 1 ]]=\"\",\"\",Totales_años[[#This Row],[TOTAL AÑO 1 ]]*$E$19+Totales_años[[#This Row],[TOTAL AÑO 1 ]])","v":""},{"$f":"IF(Totales_años[[#This Row],[TOTAL AÑO 1 ]]=\"\",\"\",Totales_años[[#This Row],[TOTAL AÑO 2 ]]*$F$19+Totales_años[[#This Row],[TOTAL AÑO 2 ]])","v":""},{"$f":"IF(Totales_años[[#This Row],[TOTAL AÑO 1 ]]=\"\",\"\",Totales_años[[#This Row],[TOTAL AÑO 3 ]]*$G$19+Totales_años[[#This Row],[TOTAL AÑO 3 ]])","v":""},null,null,null,null,null,null,null,null,null,null,null,null,null,null,null,null,null,null,null,null,null,null,null,null,null,null,null,null,null,null,null,null,null,null,null,null,null,null,null,null,null,null,null,null,null,null,null,null,null,null,null,null,null,null,null,null,null,null,null,null,null,null,null,null,{"$f":"IF(Totales_años[[#This Row],[TOTAL AÑO 1 ]]<>\"\",Totales_años[[#This Row],[TOTAL AÑO 1 ]],NA())","v":{"$error":"#N/A"}}]
[null,{"$f":"IF(C63=\"\",\"\",'ANEXO INGRESOS'!C18)","v":""},{"$f":"IF('ANEXO INGRESOS'!D18=\"\",\"\",'ANEXO INGRESOS'!D18)","v":""},{"$f":"IF(Totales_años[[#This Row],[MES/PRODUCTO]]=\"\",\"\",P29)","v":""},{"$f":"IF(Totales_años[[#This Row],[TOTAL AÑO 1 ]]=\"\",\"\",Totales_años[[#This Row],[TOTAL AÑO 1 ]]*$E$19+Totales_años[[#This Row],[TOTAL AÑO 1 ]])","v":""},{"$f":"IF(Totales_años[[#This Row],[TOTAL AÑO 1 ]]=\"\",\"\",Totales_años[[#This Row],[TOTAL AÑO 2 ]]*$F$19+Totales_años[[#This Row],[TOTAL AÑO 2 ]])","v":""},{"$f":"IF(Totales_años[[#This Row],[TOTAL AÑO 1 ]]=\"\",\"\",Totales_años[[#This Row],[TOTAL AÑO 3 ]]*$G$19+Totales_años[[#This Row],[TOTAL AÑO 3 ]])","v":""},null,null,null,null,null,null,null,null,null,null,null,null,null,null,null,null,null,null,null,null,null,null,null,null,null,null,null,null,null,null,null,null,null,null,null,null,null,null,null,null,null,null,null,null,null,null,null,null,null,null,null,null,null,null,null,null,null,null,null,null,null,null,null,null,{"$f":"IF(Totales_años[[#This Row],[TOTAL AÑO 1 ]]<>\"\",Totales_años[[#This Row],[TOTAL AÑO 1 ]],NA())","v":{"$error":"#N/A"}}]
[null,{"$f":"IF(C64=\"\",\"\",'ANEXO INGRESOS'!C19)","v":""},{"$f":"IF('ANEXO INGRESOS'!D19=\"\",\"\",'ANEXO INGRESOS'!D19)","v":""},{"$f":"IF(Totales_años[[#This Row],[MES/PRODUCTO]]=\"\",\"\",P30)","v":""},{"$f":"IF(Totales_años[[#This Row],[TOTAL AÑO 1 ]]=\"\",\"\",Totales_años[[#This Row],[TOTAL AÑO 1 ]]*$E$19+Totales_años[[#This Row],[TOTAL AÑO 1 ]])","v":""},{"$f":"IF(Totales_años[[#This Row],[TOTAL AÑO 1 ]]=\"\",\"\",Totales_años[[#This Row],[TOTAL AÑO 2 ]]*$F$19+Totales_años[[#This Row],[TOTAL AÑO 2 ]])","v":""},{"$f":"IF(Totales_años[[#This Row],[TOTAL AÑO 1 ]]=\"\",\"\",Totales_años[[#This Row],[TOTAL AÑO 3 ]]*$G$19+Totales_años[[#This Row],[TOTAL AÑO 3 ]])","v":""},null,null,null,null,null,null,null,null,null,null,null,null,null,null,null,null,null,null,null,null,null,null,null,null,null,null,null,null,null,null,null,null,null,null,null,null,null,null,null,null,null,null,null,null,null,null,null,null,null,null,null,null,null,null,null,null,null,null,null,null,null,null,null,null,{"$f":"IF(Totales_años[[#This Row],[TOTAL AÑO 1 ]]<>\"\",Totales_años[[#This Row],[TOTAL AÑO 1 ]],NA())","v":{"$error":"#N/A"}}]
[null,{"$f":"IF(C65=\"\",\"\",'ANEXO INGRESOS'!C20)","v":""},{"$f":"IF('ANEXO INGRESOS'!D20=\"\",\"\",'ANEXO INGRESOS'!D20)","v":""},{"$f":"IF(Totales_años[[#This Row],[MES/PRODUCTO]]=\"\",\"\",P31)","v":""},{"$f":"IF(Totales_años[[#This Row],[TOTAL AÑO 1 ]]=\"\",\"\",Totales_años[[#This Row],[TOTAL AÑO 1 ]]*$E$19+Totales_años[[#This Row],[TOTAL AÑO 1 ]])","v":""},{"$f":"IF(Totales_años[[#This Row],[TOTAL AÑO 1 ]]=\"\",\"\",Totales_años[[#This Row],[TOTAL AÑO 2 ]]*$F$19+Totales_años[[#This Row],[TOTAL AÑO 2 ]])","v":""},{"$f":"IF(Totales_años[[#This Row],[TOTAL AÑO 1 ]]=\"\",\"\",Totales_años[[#This Row],[TOTAL AÑO 3 ]]*$G$19+Totales_años[[#This Row],[TOTAL AÑO 3 ]])","v":""},null,null,null,null,null,null,null,null,null,null,null,null,null,null,null,null,null,null,null,null,null,null,null,null,null,null,null,null,null,null,null,null,null,null,null,null,null,null,null,null,null,null,null,null,null,null,null,null,null,null,null,null,null,null,null,null,null,null,null,null,null,null,null,null,{"$f":"IF(Totales_años[[#This Row],[TOTAL AÑO 1 ]]<>\"\",Totales_años[[#This Row],[TOTAL AÑO 1 ]],NA())","v":{"$error":"#N/A"}}]
[null,{"$f":"IF(C66=\"\",\"\",'ANEXO INGRESOS'!C21)","v":""},{"$f":"IF('ANEXO INGRESOS'!D21=\"\",\"\",'ANEXO INGRESOS'!D21)","v":""},{"$f":"IF(Totales_años[[#This Row],[MES/PRODUCTO]]=\"\",\"\",P32)","v":""},{"$f":"IF(Totales_años[[#This Row],[TOTAL AÑO 1 ]]=\"\",\"\",Totales_años[[#This Row],[TOTAL AÑO 1 ]]*$E$19+Totales_años[[#This Row],[TOTAL AÑO 1 ]])","v":""},{"$f":"IF(Totales_años[[#This Row],[TOTAL AÑO 1 ]]=\"\",\"\",Totales_años[[#This Row],[TOTAL AÑO 2 ]]*$F$19+Totales_años[[#This Row],[TOTAL AÑO 2 ]])","v":""},{"$f":"IF(Totales_años[[#This Row],[TOTAL AÑO 1 ]]=\"\",\"\",Totales_años[[#This Row],[TOTAL AÑO 3 ]]*$G$19+Totales_años[[#This Row],[TOTAL AÑO 3 ]])","v":""},null,null,null,null,null,null,null,null,null,null,null,null,null,null,null,null,null,null,null,null,null,null,null,null,null,null,null,null,null,null,null,null,null,null,null,null,null,null,null,null,null,null,null,null,null,null,null,null,null,null,null,null,null,null,null,null,null,null,null,null,null,null,null,null,{"$f":"IF(Totales_años[[#This Row],[TOTAL AÑO 1 ]]<>\"\",Totales_años[[#This Row],[TOTAL AÑO 1 ]],NA())","v":{"$error":"#N/A"}}]
[null,{"$f":"IF(C67=\"\",\"\",'ANEXO INGRESOS'!C22)","v":""},{"$f":"IF('ANEXO INGRESOS'!D22=\"\",\"\",'ANEXO INGRESOS'!D22)","v":""},{"$f":"IF(Totales_años[[#This Row],[MES/PRODUCTO]]=\"\",\"\",P33)","v":""},{"$f":"IF(Totales_años[[#This Row],[TOTAL AÑO 1 ]]=\"\",\"\",Totales_años[[#This Row],[TOTAL AÑO 1 ]]*$E$19+Totales_años[[#This Row],[TOTAL AÑO 1 ]])","v":""},{"$f":"IF(Totales_años[[#This Row],[TOTAL AÑO 1 ]]=\"\",\"\",Totales_años[[#This Row],[TOTAL AÑO 2 ]]*$F$19+Totales_años[[#This Row],[TOTAL AÑO 2 ]])","v":""},{"$f":"IF(Totales_años[[#This Row],[TOTAL AÑO 1 ]]=\"\",\"\",Totales_años[[#This Row],[TOTAL AÑO 3 ]]*$G$19+Totales_años[[#This Row],[TOTAL AÑO 3 ]])","v":""},null,null,null,null,null,null,null,null,null,null,null,null,null,null,null,null,null,null,null,null,null,null,null,null,null,null,null,null,null,null,null,null,null,null,null,null,null,null,null,null,null,null,null,null,null,null,null,null,null,null,null,null,null,null,null,null,null,null,null,null,null,null,null,null,{"$f":"IF(Totales_años[[#This Row],[TOTAL AÑO 1 ]]<>\"\",Totales_años[[#This Row],[TOTAL AÑO 1 ]],NA())","v":{"$error":"#N/A"}}]
[null,{"$f":"IF(C68=\"\",\"\",'ANEXO INGRESOS'!C23)","v":""},{"$f":"IF('ANEXO INGRESOS'!D23=\"\",\"\",'ANEXO INGRESOS'!D23)","v":""},{"$f":"IF(Totales_años[[#This Row],[MES/PRODUCTO]]=\"\",\"\",P34)","v":""},{"$f":"IF(Totales_años[[#This Row],[TOTAL AÑO 1 ]]=\"\",\"\",Totales_años[[#This Row],[TOTAL AÑO 1 ]]*$E$19+Totales_años[[#This Row],[TOTAL AÑO 1 ]])","v":""},{"$f":"IF(Totales_años[[#This Row],[TOTAL AÑO 1 ]]=\"\",\"\",Totales_años[[#This Row],[TOTAL AÑO 2 ]]*$F$19+Totales_años[[#This Row],[TOTAL AÑO 2 ]])","v":""},{"$f":"IF(Totales_años[[#This Row],[TOTAL AÑO 1 ]]=\"\",\"\",Totales_años[[#This Row],[TOTAL AÑO 3 ]]*$G$19+Totales_años[[#This Row],[TOTAL AÑO 3 ]])","v":""},null,null,null,null,null,null,null,null,null,null,null,null,null,null,null,null,null,null,null,null,null,null,null,null,null,null,null,null,null,null,null,null,null,null,null,null,null,null,null,null,null,null,null,null,null,null,null,null,null,null,null,null,null,null,null,null,null,null,null,null,null,null,null,null,{"$f":"IF(Totales_años[[#This Row],[TOTAL AÑO 1 ]]<>\"\",Totales_años[[#This Row],[TOTAL AÑO 1 ]],NA())","v":{"$error":"#N/A"}}]
[null,{"$f":"IF(C69=\"\",\"\",'ANEXO INGRESOS'!C24)","v":""},{"$f":"IF('ANEXO INGRESOS'!D24=\"\",\"\",'ANEXO INGRESOS'!D24)","v":""},{"$f":"IF(Totales_años[[#This Row],[MES/PRODUCTO]]=\"\",\"\",P35)","v":""},{"$f":"IF(Totales_años[[#This Row],[TOTAL AÑO 1 ]]=\"\",\"\",Totales_años[[#This Row],[TOTAL AÑO 1 ]]*$E$19+Totales_años[[#This Row],[TOTAL AÑO 1 ]])","v":""},{"$f":"IF(Totales_años[[#This Row],[TOTAL AÑO 1 ]]=\"\",\"\",Totales_años[[#This Row],[TOTAL AÑO 2 ]]*$F$19+Totales_años[[#This Row],[TOTAL AÑO 2 ]])","v":""},{"$f":"IF(Totales_años[[#This Row],[TOTAL AÑO 1 ]]=\"\",\"\",Totales_años[[#This Row],[TOTAL AÑO 3 ]]*$G$19+Totales_años[[#This Row],[TOTAL AÑO 3 ]])","v":""},null,null,null,null,null,null,null,null,null,null,null,null,null,null,null,null,null,null,null,null,null,null,null,null,null,null,null,null,null,null,null,null,null,null,null,null,null,null,null,null,null,null,null,null,null,null,null,null,null,null,null,null,null,null,null,null,null,null,null,null,null,null,null,null,{"$f":"IF(Totales_años[[#This Row],[TOTAL AÑO 1 ]]<>\"\",Totales_años[[#This Row],[TOTAL AÑO 1 ]],NA())","v":{"$error":"#N/A"}}]
[null,{"$f":"IF(C70=\"\",\"\",'ANEXO INGRESOS'!C25)","v":""},{"$f":"IF('ANEXO INGRESOS'!D25=\"\",\"\",'ANEXO INGRESOS'!D25)","v":""},{"$f":"IF(Totales_años[[#This Row],[MES/PRODUCTO]]=\"\",\"\",P36)","v":""},{"$f":"IF(Totales_años[[#This Row],[TOTAL AÑO 1 ]]=\"\",\"\",Totales_años[[#This Row],[TOTAL AÑO 1 ]]*$E$19+Totales_años[[#This Row],[TOTAL AÑO 1 ]])","v":""},{"$f":"IF(Totales_años[[#This Row],[TOTAL AÑO 1 ]]=\"\",\"\",Totales_años[[#This Row],[TOTAL AÑO 2 ]]*$F$19+Totales_años[[#This Row],[TOTAL AÑO 2 ]])","v":""},{"$f":"IF(Totales_años[[#This Row],[TOTAL AÑO 1 ]]=\"\",\"\",Totales_años[[#This Row],[TOTAL AÑO 3 ]]*$G$19+Totales_años[[#This Row],[TOTAL AÑO 3 ]])","v":""},null,null,null,null,null,null,null,null,null,null,null,null,null,null,null,null,null,null,null,null,null,null,null,null,null,null,null,null,null,null,null,null,null,null,null,null,null,null,null,null,null,null,null,null,null,null,null,null,null,null,null,null,null,null,null,null,null,null,null,null,null,null,null,null,{"$f":"IF(Totales_años[[#This Row],[TOTAL AÑO 1 ]]<>\"\",Totales_años[[#This Row],[TOTAL AÑO 1 ]],NA())","v":{"$error":"#N/A"}}]
[null,{"$f":"IF(C71=\"\",\"\",'ANEXO INGRESOS'!C26)","v":""},{"$f":"IF('ANEXO INGRESOS'!D26=\"\",\"\",'ANEXO INGRESOS'!D26)","v":""},{"$f":"IF(Totales_años[[#This Row],[MES/PRODUCTO]]=\"\",\"\",P37)","v":""},{"$f":"IF(Totales_años[[#This Row],[TOTAL AÑO 1 ]]=\"\",\"\",Totales_años[[#This Row],[TOTAL AÑO 1 ]]*$E$19+Totales_años[[#This Row],[TOTAL AÑO 1 ]])","v":""},{"$f":"IF(Totales_años[[#This Row],[TOTAL AÑO 1 ]]=\"\",\"\",Totales_años[[#This Row],[TOTAL AÑO 2 ]]*$F$19+Totales_años[[#This Row],[TOTAL AÑO 2 ]])","v":""},{"$f":"IF(Totales_años[[#This Row],[TOTAL AÑO 1 ]]=\"\",\"\",Totales_años[[#This Row],[TOTAL AÑO 3 ]]*$G$19+Totales_años[[#This Row],[TOTAL AÑO 3 ]])","v":""},null,null,null,null,null,null,null,null,null,null,null,null,null,null,null,null,null,null,null,null,null,null,null,null,null,null,null,null,null,null,null,null,null,null,null,null,null,null,null,null,null,null,null,null,null,null,null,null,null,null,null,null,null,null,null,null,null,null,null,null,null,null,null,null,{"$f":"IF(Totales_años[[#This Row],[TOTAL AÑO 1 ]]<>\"\",Totales_años[[#This Row],[TOTAL AÑO 1 ]],NA())","v":{"$error":"#N/A"}}]
[null,{"$f":"IF(C72=\"\",\"\",'ANEXO INGRESOS'!C27)","v":""},{"$f":"IF('ANEXO INGRESOS'!D27=\"\",\"\",'ANEXO INGRESOS'!D27)","v":""},{"$f":"IF(Totales_años[[#This Row],[MES/PRODUCTO]]=\"\",\"\",P38)","v":""},{"$f":"IF(Totales_años[[#This Row],[TOTAL AÑO 1 ]]=\"\",\"\",Totales_años[[#This Row],[TOTAL AÑO 1 ]]*$E$19+Totales_años[[#This Row],[TOTAL AÑO 1 ]])","v":""},{"$f":"IF(Totales_años[[#This Row],[TOTAL AÑO 1 ]]=\"\",\"\",Totales_años[[#This Row],[TOTAL AÑO 2 ]]*$F$19+Totales_años[[#This Row],[TOTAL AÑO 2 ]])","v":""},{"$f":"IF(Totales_años[[#This Row],[TOTAL AÑO 1 ]]=\"\",\"\",Totales_años[[#This Row],[TOTAL AÑO 3 ]]*$G$19+Totales_años[[#This Row],[TOTAL AÑO 3 ]])","v":""},null,null,null,null,null,null,null,null,null,null,null,null,null,null,null,null,null,null,null,null,null,null,null,null,null,null,null,null,null,null,null,null,null,null,null,null,null,null,null,null,null,null,null,null,null,null,null,null,null,null,null,null,null,null,null,null,null,null,null,null,null,null,null,null,{"$f":"IF(Totales_años[[#This Row],[TOTAL AÑO 1 ]]<>\"\",Totales_años[[#This Row],[TOTAL AÑO 1 ]],NA())","v":{"$error":"#N/A"}}]
[null,{"$f":"IF(C73=\"\",\"\",'ANEXO INGRESOS'!C28)","v":""},{"$f":"IF('ANEXO INGRESOS'!D28=\"\",\"\",'ANEXO INGRESOS'!D28)","v":""},{"$f":"IF(Totales_años[[#This Row],[MES/PRODUCTO]]=\"\",\"\",P39)","v":""},{"$f":"IF(Totales_años[[#This Row],[TOTAL AÑO 1 ]]=\"\",\"\",Totales_años[[#This Row],[TOTAL AÑO 1 ]]*$E$19+Totales_años[[#This Row],[TOTAL AÑO 1 ]])","v":""},{"$f":"IF(Totales_años[[#This Row],[TOTAL AÑO 1 ]]=\"\",\"\",Totales_años[[#This Row],[TOTAL AÑO 2 ]]*$F$19+Totales_años[[#This Row],[TOTAL AÑO 2 ]])","v":""},{"$f":"IF(Totales_años[[#This Row],[TOTAL AÑO 1 ]]=\"\",\"\",Totales_años[[#This Row],[TOTAL AÑO 3 ]]*$G$19+Totales_años[[#This Row],[TOTAL AÑO 3 ]])","v":""},null,null,null,null,null,null,null,null,null,null,null,null,null,null,null,null,null,null,null,null,null,null,null,null,null,null,null,null,null,null,null,null,null,null,null,null,null,null,null,null,null,null,null,null,null,null,null,null,null,null,null,null,null,null,null,null,null,null,null,null,null,null,null,null,{"$f":"IF(Totales_años[[#This Row],[TOTAL AÑO 1 ]]<>\"\",Totales_años[[#This Row],[TOTAL AÑO 1 ]],NA())","v":{"$error":"#N/A"}}]
[null,{"$f":"IF(C74=\"\",\"\",'ANEXO INGRESOS'!C29)","v":""},{"$f":"IF('ANEXO INGRESOS'!D29=\"\",\"\",'ANEXO INGRESOS'!D29)","v":""},{"$f":"IF(Totales_años[[#This Row],[MES/PRODUCTO]]=\"\",\"\",P40)","v":""},{"$f":"IF(Totales_años[[#This Row],[TOTAL AÑO 1 ]]=\"\",\"\",Totales_años[[#This Row],[TOTAL AÑO 1 ]]*$E$19+Totales_años[[#This Row],[TOTAL AÑO 1 ]])","v":""},{"$f":"IF(Totales_años[[#This Row],[TOTAL AÑO 1 ]]=\"\",\"\",Totales_años[[#This Row],[TOTAL AÑO 2 ]]*$F$19+Totales_años[[#This Row],[TOTAL AÑO 2 ]])","v":""},{"$f":"IF(Totales_años[[#This Row],[TOTAL AÑO 1 ]]=\"\",\"\",Totales_años[[#This Row],[TOTAL AÑO 3 ]]*$G$19+Totales_años[[#This Row],[TOTAL AÑO 3 ]])","v":""},null,null,null,null,null,null,null,null,null,null,null,null,null,null,null,null,null,null,null,null,null,null,null,null,null,null,null,null,null,null,null,null,null,null,null,null,null,null,null,null,null,null,null,null,null,null,null,null,null,null,null,null,null,null,null,null,null,null,null,null,null,null,null,null,{"$f":"IF(Totales_años[[#This Row],[TOTAL AÑO 1 ]]<>\"\",Totales_años[[#This Row],[TOTAL AÑO 1 ]],NA())","v":{"$error":"#N/A"}}]
[null,{"$f":"IF(C75=\"\",\"\",'ANEXO INGRESOS'!C30)","v":""},{"$f":"IF('ANEXO INGRESOS'!D30=\"\",\"\",'ANEXO INGRESOS'!D30)","v":""},{"$f":"IF(Totales_años[[#This Row],[MES/PRODUCTO]]=\"\",\"\",P41)","v":""},{"$f":"IF(Totales_años[[#This Row],[TOTAL AÑO 1 ]]=\"\",\"\",Totales_años[[#This Row],[TOTAL AÑO 1 ]]*$E$19+Totales_años[[#This Row],[TOTAL AÑO 1 ]])","v":""},{"$f":"IF(Totales_años[[#This Row],[TOTAL AÑO 1 ]]=\"\",\"\",Totales_años[[#This Row],[TOTAL AÑO 2 ]]*$F$19+Totales_años[[#This Row],[TOTAL AÑO 2 ]])","v":""},{"$f":"IF(Totales_años[[#This Row],[TOTAL AÑO 1 ]]=\"\",\"\",Totales_años[[#This Row],[TOTAL AÑO 3 ]]*$G$19+Totales_años[[#This Row],[TOTAL AÑO 3 ]])","v":""},null,null,null,null,null,null,null,null,null,null,null,null,null,null,null,null,null,null,null,null,null,null,null,null,null,null,null,null,null,null,null,null,null,null,null,null,null,null,null,null,null,null,null,null,null,null,null,null,null,null,null,null,null,null,null,null,null,null,null,null,null,null,null,null,{"$f":"IF(Totales_años[[#This Row],[TOTAL AÑO 1 ]]<>\"\",Totales_años[[#This Row],[TOTAL AÑO 1 ]],NA())","v":{"$error":"#N/A"}}]
[null,{"$f":"IF(C76=\"\",\"\",'ANEXO INGRESOS'!C31)","v":""},{"$f":"IF('ANEXO INGRESOS'!D31=\"\",\"\",'ANEXO INGRESOS'!D31)","v":""},{"$f":"IF(Totales_años[[#This Row],[MES/PRODUCTO]]=\"\",\"\",P42)","v":""},{"$f":"IF(Totales_años[[#This Row],[TOTAL AÑO 1 ]]=\"\",\"\",Totales_años[[#This Row],[TOTAL AÑO 1 ]]*$E$19+Totales_años[[#This Row],[TOTAL AÑO 1 ]])","v":""},{"$f":"IF(Totales_años[[#This Row],[TOTAL AÑO 1 ]]=\"\",\"\",Totales_años[[#This Row],[TOTAL AÑO 2 ]]*$F$19+Totales_años[[#This Row],[TOTAL AÑO 2 ]])","v":""},{"$f":"IF(Totales_años[[#This Row],[TOTAL AÑO 1 ]]=\"\",\"\",Totales_años[[#This Row],[TOTAL AÑO 3 ]]*$G$19+Totales_años[[#This Row],[TOTAL AÑO 3 ]])","v":""},null,null,null,null,null,null,null,null,null,null,null,null,null,null,null,null,null,null,null,null,null,null,null,null,null,null,null,null,null,null,null,null,null,null,null,null,null,null,null,null,null,null,null,null,null,null,null,null,null,null,null,null,null,null,null,null,null,null,null,null,null,null,null,null,{"$f":"IF(Totales_años[[#This Row],[TOTAL AÑO 1 ]]<>\"\",Totales_años[[#This Row],[TOTAL AÑO 1 ]],NA())","v":{"$error":"#N/A"}}]
[null,{"$f":"IF(C77=\"\",\"\",'ANEXO INGRESOS'!C32)","v":""},{"$f":"IF('ANEXO INGRESOS'!D32=\"\",\"\",'ANEXO INGRESOS'!D32)","v":""},{"$f":"IF(Totales_años[[#This Row],[MES/PRODUCTO]]=\"\",\"\",P43)","v":""},{"$f":"IF(Totales_años[[#This Row],[TOTAL AÑO 1 ]]=\"\",\"\",Totales_años[[#This Row],[TOTAL AÑO 1 ]]*$E$19+Totales_años[[#This Row],[TOTAL AÑO 1 ]])","v":""},{"$f":"IF(Totales_años[[#This Row],[TOTAL AÑO 1 ]]=\"\",\"\",Totales_años[[#This Row],[TOTAL AÑO 2 ]]*$F$19+Totales_años[[#This Row],[TOTAL AÑO 2 ]])","v":""},{"$f":"IF(Totales_años[[#This Row],[TOTAL AÑO 1 ]]=\"\",\"\",Totales_años[[#This Row],[TOTAL AÑO 3 ]]*$G$19+Totales_años[[#This Row],[TOTAL AÑO 3 ]])","v":""},null,null,null,null,null,null,null,null,null,null,null,null,null,null,null,null,null,null,null,null,null,null,null,null,null,null,null,null,null,null,null,null,null,null,null,null,null,null,null,null,null,null,null,null,null,null,null,null,null,null,null,null,null,null,null,null,null,null,null,null,null,null,null,null,{"$f":"IF(Totales_años[[#This Row],[TOTAL AÑO 1 ]]<>\"\",Totales_años[[#This Row],[TOTAL AÑO 1 ]],NA())","v":{"$error":"#N/A"}}]
[null,{"$f":"IF(C78=\"\",\"\",'ANEXO INGRESOS'!C33)","v":""},{"$f":"IF('ANEXO INGRESOS'!D33=\"\",\"\",'ANEXO INGRESOS'!D33)","v":""},{"$f":"IF(Totales_años[[#This Row],[MES/PRODUCTO]]=\"\",\"\",P44)","v":""},{"$f":"IF(Totales_años[[#This Row],[TOTAL AÑO 1 ]]=\"\",\"\",Totales_años[[#This Row],[TOTAL AÑO 1 ]]*$E$19+Totales_años[[#This Row],[TOTAL AÑO 1 ]])","v":""},{"$f":"IF(Totales_años[[#This Row],[TOTAL AÑO 1 ]]=\"\",\"\",Totales_años[[#This Row],[TOTAL AÑO 2 ]]*$F$19+Totales_años[[#This Row],[TOTAL AÑO 2 ]])","v":""},{"$f":"IF(Totales_años[[#This Row],[TOTAL AÑO 1 ]]=\"\",\"\",Totales_años[[#This Row],[TOTAL AÑO 3 ]]*$G$19+Totales_años[[#This Row],[TOTAL AÑO 3 ]])","v":""},null,null,null,null,null,null,null,null,null,null,null,null,null,null,null,null,null,null,null,null,null,null,null,null,null,null,null,null,null,null,null,null,null,null,null,null,null,null,null,null,null,null,null,null,null,null,null,null,null,null,null,null,null,null,null,null,null,null,null,null,null,null,null,null,{"$f":"IF(Totales_años[[#This Row],[TOTAL AÑO 1 ]]<>\"\",Totales_años[[#This Row],[TOTAL AÑO 1 ]],NA())","v":{"$error":"#N/A"}}]
[null,{"$f":"IF(C79=\"\",\"\",'ANEXO INGRESOS'!C34)","v":""},{"$f":"IF('ANEXO INGRESOS'!D34=\"\",\"\",'ANEXO INGRESOS'!D34)","v":""},{"$f":"IF(Totales_años[[#This Row],[MES/PRODUCTO]]=\"\",\"\",P45)","v":""},{"$f":"IF(Totales_años[[#This Row],[TOTAL AÑO 1 ]]=\"\",\"\",Totales_años[[#This Row],[TOTAL AÑO 1 ]]*$E$19+Totales_años[[#This Row],[TOTAL AÑO 1 ]])","v":""},{"$f":"IF(Totales_años[[#This Row],[TOTAL AÑO 1 ]]=\"\",\"\",Totales_años[[#This Row],[TOTAL AÑO 2 ]]*$F$19+Totales_años[[#This Row],[TOTAL AÑO 2 ]])","v":""},{"$f":"IF(Totales_años[[#This Row],[TOTAL AÑO 1 ]]=\"\",\"\",Totales_años[[#This Row],[TOTAL AÑO 3 ]]*$G$19+Totales_años[[#This Row],[TOTAL AÑO 3 ]])","v":""},null,null,null,null,null,null,null,null,null,null,null,null,null,null,null,null,null,null,null,null,null,null,null,null,null,null,null,null,null,null,null,null,null,null,null,null,null,null,null,null,null,null,null,null,null,null,null,null,null,null,null,null,null,null,null,null,null,null,null,null,null,null,null,null,{"$f":"IF(Totales_años[[#This Row],[TOTAL AÑO 1 ]]<>\"\",Totales_años[[#This Row],[TOTAL AÑO 1 ]],NA())","v":{"$error":"#N/A"}}]
[null,{"$f":"IF(C80=\"\",\"\",'ANEXO INGRESOS'!C35)","v":""},{"$f":"IF('ANEXO INGRESOS'!D35=\"\",\"\",'ANEXO INGRESOS'!D35)","v":""},{"$f":"IF(Totales_años[[#This Row],[MES/PRODUCTO]]=\"\",\"\",P46)","v":""},{"$f":"IF(Totales_años[[#This Row],[TOTAL AÑO 1 ]]=\"\",\"\",Totales_años[[#This Row],[TOTAL AÑO 1 ]]*$E$19+Totales_años[[#This Row],[TOTAL AÑO 1 ]])","v":""},{"$f":"IF(Totales_años[[#This Row],[TOTAL AÑO 1 ]]=\"\",\"\",Totales_años[[#This Row],[TOTAL AÑO 2 ]]*$F$19+Totales_años[[#This Row],[TOTAL AÑO 2 ]])","v":""},{"$f":"IF(Totales_años[[#This Row],[TOTAL AÑO 1 ]]=\"\",\"\",Totales_años[[#This Row],[TOTAL AÑO 3 ]]*$G$19+Totales_años[[#This Row],[TOTAL AÑO 3 ]])","v":""},null,null,null,null,null,null,null,null,null,null,null,null,null,null,null,null,null,null,null,null,null,null,null,null,null,null,null,null,null,null,null,null,null,null,null,null,null,null,null,null,null,null,null,null,null,null,null,null,null,null,null,null,null,null,null,null,null,null,null,null,null,null,null,null,{"$f":"IF(Totales_años[[#This Row],[TOTAL AÑO 1 ]]<>\"\",Totales_años[[#This Row],[TOTAL AÑO 1 ]],NA())","v":{"$error":"#N/A"}}]
[null,{"$f":"IF(C81=\"\",\"\",'ANEXO INGRESOS'!C36)","v":""},{"$f":"IF('ANEXO INGRESOS'!D36=\"\",\"\",'ANEXO INGRESOS'!D36)","v":""},{"$f":"IF(Totales_años[[#This Row],[MES/PRODUCTO]]=\"\",\"\",P47)","v":""},{"$f":"IF(Totales_años[[#This Row],[TOTAL AÑO 1 ]]=\"\",\"\",Totales_años[[#This Row],[TOTAL AÑO 1 ]]*$E$19+Totales_años[[#This Row],[TOTAL AÑO 1 ]])","v":""},{"$f":"IF(Totales_años[[#This Row],[TOTAL AÑO 1 ]]=\"\",\"\",Totales_años[[#This Row],[TOTAL AÑO 2 ]]*$F$19+Totales_años[[#This Row],[TOTAL AÑO 2 ]])","v":""},{"$f":"IF(Totales_años[[#This Row],[TOTAL AÑO 1 ]]=\"\",\"\",Totales_años[[#This Row],[TOTAL AÑO 3 ]]*$G$19+Totales_años[[#This Row],[TOTAL AÑO 3 ]])","v":""},null,null,null,null,null,null,null,null,null,null,null,null,null,null,null,null,null,null,null,null,null,null,null,null,null,null,null,null,null,null,null,null,null,null,null,null,null,null,null,null,null,null,null,null,null,null,null,null,null,null,null,null,null,null,null,null,null,null,null,null,null,null,null,null,{"$f":"IF(Totales_años[[#This Row],[TOTAL AÑO 1 ]]<>\"\",Totales_años[[#This Row],[TOTAL AÑO 1 ]],NA())","v":{"$error":"#N/A"}}]
[null,{"$f":"IF(C82=\"\",\"\",'ANEXO INGRESOS'!C37)","v":""},{"$f":"IF('ANEXO INGRESOS'!D37=\"\",\"\",'ANEXO INGRESOS'!D37)","v":""},{"$f":"IF(Totales_años[[#This Row],[MES/PRODUCTO]]=\"\",\"\",P48)","v":""},{"$f":"IF(Totales_años[[#This Row],[TOTAL AÑO 1 ]]=\"\",\"\",Totales_años[[#This Row],[TOTAL AÑO 1 ]]*$E$19+Totales_años[[#This Row],[TOTAL AÑO 1 ]])","v":""},{"$f":"IF(Totales_años[[#This Row],[TOTAL AÑO 1 ]]=\"\",\"\",Totales_años[[#This Row],[TOTAL AÑO 2 ]]*$F$19+Totales_años[[#This Row],[TOTAL AÑO 2 ]])","v":""},{"$f":"IF(Totales_años[[#This Row],[TOTAL AÑO 1 ]]=\"\",\"\",Totales_años[[#This Row],[TOTAL AÑO 3 ]]*$G$19+Totales_años[[#This Row],[TOTAL AÑO 3 ]])","v":""},null,null,null,null,null,null,null,null,null,null,null,null,null,null,null,null,null,null,null,null,null,null,null,null,null,null,null,null,null,null,null,null,null,null,null,null,null,null,null,null,null,null,null,null,null,null,null,null,null,null,null,null,null,null,null,null,null,null,null,null,null,null,null,null,{"$f":"IF(Totales_años[[#This Row],[TOTAL AÑO 1 ]]<>\"\",Totales_años[[#This Row],[TOTAL AÑO 1 ]],NA())","v":{"$error":"#N/A"}}]
[null,{"$f":"IF(C83=\"\",\"\",'ANEXO INGRESOS'!C38)","v":""},{"$f":"IF('ANEXO INGRESOS'!D38=\"\",\"\",'ANEXO INGRESOS'!D38)","v":""},{"$f":"IF(Totales_años[[#This Row],[MES/PRODUCTO]]=\"\",\"\",P49)","v":""},{"$f":"IF(Totales_años[[#This Row],[TOTAL AÑO 1 ]]=\"\",\"\",Totales_años[[#This Row],[TOTAL AÑO 1 ]]*$E$19+Totales_años[[#This Row],[TOTAL AÑO 1 ]])","v":""},{"$f":"IF(Totales_años[[#This Row],[TOTAL AÑO 1 ]]=\"\",\"\",Totales_años[[#This Row],[TOTAL AÑO 2 ]]*$F$19+Totales_años[[#This Row],[TOTAL AÑO 2 ]])","v":""},{"$f":"IF(Totales_años[[#This Row],[TOTAL AÑO 1 ]]=\"\",\"\",Totales_años[[#This Row],[TOTAL AÑO 3 ]]*$G$19+Totales_años[[#This Row],[TOTAL AÑO 3 ]])","v":""},null,null,null,null,null,null,null,null,null,null,null,null,null,null,null,null,null,null,null,null,null,null,null,null,null,null,null,null,null,null,null,null,null,null,null,null,null,null,null,null,null,null,null,null,null,null,null,null,null,null,null,null,null,null,null,null,null,null,null,null,null,null,null,null,{"$f":"IF(Totales_años[[#This Row],[TOTAL AÑO 1 ]]<>\"\",Totales_años[[#This Row],[TOTAL AÑO 1 ]],NA())","v":{"$error":"#N/A"}}]
[null,{"$f":"IF(C84=\"\",\"\",'ANEXO INGRESOS'!C39)","v":""},{"$f":"IF('ANEXO INGRESOS'!D39=\"\",\"\",'ANEXO INGRESOS'!D39)","v":""},{"$f":"IF(Totales_años[[#This Row],[MES/PRODUCTO]]=\"\",\"\",P50)","v":""},{"$f":"IF(Totales_años[[#This Row],[TOTAL AÑO 1 ]]=\"\",\"\",Totales_años[[#This Row],[TOTAL AÑO 1 ]]*$E$19+Totales_años[[#This Row],[TOTAL AÑO 1 ]])","v":""},{"$f":"IF(Totales_años[[#This Row],[TOTAL AÑO 1 ]]=\"\",\"\",Totales_años[[#This Row],[TOTAL AÑO 2 ]]*$F$19+Totales_años[[#This Row],[TOTAL AÑO 2 ]])","v":""},{"$f":"IF(Totales_años[[#This Row],[TOTAL AÑO 1 ]]=\"\",\"\",Totales_años[[#This Row],[TOTAL AÑO 3 ]]*$G$19+Totales_años[[#This Row],[TOTAL AÑO 3 ]])","v":""}]
[null,null,"TOTAL",{"$f":"SUM(D59:D84)","v":0},{"$f":"SUM(E59:E84)","v":0},{"$f":"SUM(F59:F84)","v":0},{"$f":"SUM(G59:G84)","v":0}]
[]
[]
[]
[]
[]
[]
[]
[]
[]
[]
[]
[]
[]
[]
[]
[]
[]
[]
[]
[]
[]
[]
[]
[]
[]
[]
[]
[]
[]
[]
[]
[]
[]
[]
[]
[]
[]
[]
[]
[]
[]
[]
[]
[]
[]
[]
[]
[null,null,"OTROS GASTOS POR  PRODUCTO O SERVICIO (en euros)",{"$f":"D23","v":"1900enero"},"1900enero","1900febrero","1900marzo","1900abril","1900mayo","1900junio","1900julio","1900agosto","1900septiembre","1900octubre","1900noviembre",null,null,null,null,null,null,null,null,null,null,null,null,null,null,null,null,null,null,null,null,"TOTAL"]
[null,"IVA","MES/PRODUCTO","Mes 1 ","Mes 2 ","Mes 3 ","Mes 4 ","Mes 5 ","Mes 6 ","Mes 7","Mes 8","Mes 9","Mes 10","Mes 11 ","Mes 12 ","TOTAL ",null,null,null,null,null,null,null,null,null,null,null,null,null,null,null,null,null,null,null,{"$f":"IF(Gastos_variables_producto9[[#This Row],[TOTAL ]]<>\"\",Gastos_variables_producto9[[#This Row],[TOTAL ]],NA())","v":{"$error":"#VALUE!"}}]
[null,{"$f":"IF(C135=\"\",\"\",'ANEXO INGRESOS'!C51)","v":""},{"$f":"IF('ANEXO INGRESOS'!D51=\"\",\"\",'ANEXO INGRESOS'!D51)","v":""},{"$f":"IF('ANEXO INGRESOS'!$D51=\"\",\"\",'ANEXO INGRESOS'!H51*'ANEXO GASTOS VARIABLES'!$K$54)","v":""},{"$f":"IF('ANEXO INGRESOS'!$D51=\"\",\"\",'ANEXO INGRESOS'!I51*'ANEXO GASTOS VARIABLES'!$K$54)","v":""},{"$f":"IF('ANEXO INGRESOS'!$D51=\"\",\"\",'ANEXO INGRESOS'!J51*'ANEXO GASTOS VARIABLES'!$K$54)","v":""},{"$f":"IF('ANEXO INGRESOS'!$D51=\"\",\"\",'ANEXO INGRESOS'!K51*'ANEXO GASTOS VARIABLES'!$K$54)","v":""},{"$f":"IF('ANEXO INGRESOS'!$D51=\"\",\"\",'ANEXO INGRESOS'!L51*'ANEXO GASTOS VARIABLES'!$K$54)","v":""},{"$f":"IF('ANEXO INGRESOS'!$D51=\"\",\"\",'ANEXO INGRESOS'!M51*'ANEXO GASTOS VARIABLES'!$K$54)","v":""},{"$f":"IF('ANEXO INGRESOS'!$D51=\"\",\"\",'ANEXO INGRESOS'!N51*'ANEXO GASTOS VARIABLES'!$K$54)","v":""},{"$f":"IF('ANEXO INGRESOS'!$D51=\"\",\"\",'ANEXO INGRESOS'!O51*'ANEXO GASTOS VARIABLES'!$K$54)","v":""},{"$f":"IF('ANEXO INGRESOS'!$D51=\"\",\"\",'ANEXO INGRESOS'!P51*'ANEXO GASTOS VARIABLES'!$K$54)","v":""},{"$f":"IF('ANEXO INGRESOS'!$D51=\"\",\"\",'ANEXO INGRESOS'!Q51*'ANEXO GASTOS VARIABLES'!$K$54)","v":""},{"$f":"IF('ANEXO INGRESOS'!$D51=\"\",\"\",'ANEXO INGRESOS'!R51*'ANEXO GASTOS VARIABLES'!$K$54)","v":""},{"$f":"IF('ANEXO INGRESOS'!$D51=\"\",\"\",'ANEXO INGRESOS'!S51*'ANEXO GASTOS VARIABLES'!$K$54)","v":""},{"$f":"IF(Gastos_variables_producto9[[#This Row],[MES/PRODUCTO]]=\"\",\"\",SUM('6.GASTOS VARIABLES'!$C135:$O135))","v":""},null,null,null,null,null,null,null,null,null,null,null,null,null,null,null,null,null,null,null,{"$f":"IF(Gastos_variables_producto9[[#This Row],[TOTAL ]]<>\"\",Gastos_variables_producto9[[#This Row],[TOTAL ]],NA())","v":{"$error":"#N/A"}}]
[null,{"$f":"IF(C136=\"\",\"\",'ANEXO INGRESOS'!C52)","v":""},{"$f":"IF('ANEXO INGRESOS'!D52=\"\",\"\",'ANEXO INGRESOS'!D52)","v":""},{"$f":"IF('ANEXO INGRESOS'!$D52=\"\",\"\",'ANEXO INGRESOS'!H52*'ANEXO GASTOS VARIABLES'!$K$54)","v":""},{"$f":"IF('ANEXO INGRESOS'!$D52=\"\",\"\",'ANEXO INGRESOS'!I52*'ANEXO GASTOS VARIABLES'!$K$54)","v":""},{"$f":"IF('ANEXO INGRESOS'!$D52=\"\",\"\",'ANEXO INGRESOS'!J52*'ANEXO GASTOS VARIABLES'!$K$54)","v":""},{"$f":"IF('ANEXO INGRESOS'!$D52=\"\",\"\",'ANEXO INGRESOS'!K52*'ANEXO GASTOS VARIABLES'!$K$54)","v":""},{"$f":"IF('ANEXO INGRESOS'!$D52=\"\",\"\",'ANEXO INGRESOS'!L52*'ANEXO GASTOS VARIABLES'!$K$54)","v":""},{"$f":"IF('ANEXO INGRESOS'!$D52=\"\",\"\",'ANEXO INGRESOS'!M52*'ANEXO GASTOS VARIABLES'!$K$54)","v":""},{"$f":"IF('ANEXO INGRESOS'!$D52=\"\",\"\",'ANEXO INGRESOS'!N52*'ANEXO GASTOS VARIABLES'!$K$54)","v":""},{"$f":"IF('ANEXO INGRESOS'!$D52=\"\",\"\",'ANEXO INGRESOS'!O52*'ANEXO GASTOS VARIABLES'!$K$54)","v":""},{"$f":"IF('ANEXO INGRESOS'!$D52=\"\",\"\",'ANEXO INGRESOS'!P52*'ANEXO GASTOS VARIABLES'!$K$54)","v":""},{"$f":"IF('ANEXO INGRESOS'!$D52=\"\",\"\",'ANEXO INGRESOS'!Q52*'ANEXO GASTOS VARIABLES'!$K$54)","v":""},{"$f":"IF('ANEXO INGRESOS'!$D52=\"\",\"\",'ANEXO INGRESOS'!R52*'ANEXO GASTOS VARIABLES'!$K$54)","v":""},{"$f":"IF('ANEXO INGRESOS'!$D52=\"\",\"\",'ANEXO INGRESOS'!S52*'ANEXO GASTOS VARIABLES'!$K$54)","v":""},{"$f":"IF(Gastos_variables_producto9[[#This Row],[MES/PRODUCTO]]=\"\",\"\",SUM('6.GASTOS VARIABLES'!$C136:$O136))","v":""},null,null,null,null,null,null,null,null,null,null,null,null,null,null,null,null,null,null,null,{"$f":"IF(Gastos_variables_producto9[[#This Row],[TOTAL ]]<>\"\",Gastos_variables_producto9[[#This Row],[TOTAL ]],NA())","v":{"$error":"#N/A"}}]
[null,{"$f":"IF(C137=\"\",\"\",'ANEXO INGRESOS'!C53)","v":""},{"$f":"IF('ANEXO INGRESOS'!D53=\"\",\"\",'ANEXO INGRESOS'!D53)","v":""},{"$f":"IF('ANEXO INGRESOS'!$D53=\"\",\"\",'ANEXO INGRESOS'!H53*'ANEXO GASTOS VARIABLES'!$K$54)","v":""},{"$f":"IF('ANEXO INGRESOS'!$D53=\"\",\"\",'ANEXO INGRESOS'!I53*'ANEXO GASTOS VARIABLES'!$K$54)","v":""},{"$f":"IF('ANEXO INGRESOS'!$D53=\"\",\"\",'ANEXO INGRESOS'!J53*'ANEXO GASTOS VARIABLES'!$K$54)","v":""},{"$f":"IF('ANEXO INGRESOS'!$D53=\"\",\"\",'ANEXO INGRESOS'!K53*'ANEXO GASTOS VARIABLES'!$K$54)","v":""},{"$f":"IF('ANEXO INGRESOS'!$D53=\"\",\"\",'ANEXO INGRESOS'!L53*'ANEXO GASTOS VARIABLES'!$K$54)","v":""},{"$f":"IF('ANEXO INGRESOS'!$D53=\"\",\"\",'ANEXO INGRESOS'!M53*'ANEXO GASTOS VARIABLES'!$K$54)","v":""},{"$f":"IF('ANEXO INGRESOS'!$D53=\"\",\"\",'ANEXO INGRESOS'!N53*'ANEXO GASTOS VARIABLES'!$K$54)","v":""},{"$f":"IF('ANEXO INGRESOS'!$D53=\"\",\"\",'ANEXO INGRESOS'!O53*'ANEXO GASTOS VARIABLES'!$K$54)","v":""},{"$f":"IF('ANEXO INGRESOS'!$D53=\"\",\"\",'ANEXO INGRESOS'!P53*'ANEXO GASTOS VARIABLES'!$K$54)","v":""},{"$f":"IF('ANEXO INGRESOS'!$D53=\"\",\"\",'ANEXO INGRESOS'!Q53*'ANEXO GASTOS VARIABLES'!$K$54)","v":""},{"$f":"IF('ANEXO INGRESOS'!$D53=\"\",\"\",'ANEXO INGRESOS'!R53*'ANEXO GASTOS VARIABLES'!$K$54)","v":""},{"$f":"IF('ANEXO INGRESOS'!$D53=\"\",\"\",'ANEXO INGRESOS'!S53*'ANEXO GASTOS VARIABLES'!$K$54)","v":""},{"$f":"IF(Gastos_variables_producto9[[#This Row],[MES/PRODUCTO]]=\"\",\"\",SUM('6.GASTOS VARIABLES'!$C137:$O137))","v":""},null,null,null,null,null,null,null,null,null,null,null,null,null,null,null,null,null,null,null,{"$f":"IF(Gastos_variables_producto9[[#This Row],[TOTAL ]]<>\"\",Gastos_variables_producto9[[#This Row],[TOTAL ]],NA())","v":{"$error":"#N/A"}}]
[null,{"$f":"IF(C138=\"\",\"\",'ANEXO INGRESOS'!C54)","v":""},{"$f":"IF('ANEXO INGRESOS'!D54=\"\",\"\",'ANEXO INGRESOS'!D54)","v":""},{"$f":"IF('ANEXO INGRESOS'!$D54=\"\",\"\",'ANEXO INGRESOS'!H54*'ANEXO GASTOS VARIABLES'!$K$54)","v":""},{"$f":"IF('ANEXO INGRESOS'!$D54=\"\",\"\",'ANEXO INGRESOS'!I54*'ANEXO GASTOS VARIABLES'!$K$54)","v":""},{"$f":"IF('ANEXO INGRESOS'!$D54=\"\",\"\",'ANEXO INGRESOS'!J54*'ANEXO GASTOS VARIABLES'!$K$54)","v":""},{"$f":"IF('ANEXO INGRESOS'!$D54=\"\",\"\",'ANEXO INGRESOS'!K54*'ANEXO GASTOS VARIABLES'!$K$54)","v":""},{"$f":"IF('ANEXO INGRESOS'!$D54=\"\",\"\",'ANEXO INGRESOS'!L54*'ANEXO GASTOS VARIABLES'!$K$54)","v":""},{"$f":"IF('ANEXO INGRESOS'!$D54=\"\",\"\",'ANEXO INGRESOS'!M54*'ANEXO GASTOS VARIABLES'!$K$54)","v":""},{"$f":"IF('ANEXO INGRESOS'!$D54=\"\",\"\",'ANEXO INGRESOS'!N54*'ANEXO GASTOS VARIABLES'!$K$54)","v":""},{"$f":"IF('ANEXO INGRESOS'!$D54=\"\",\"\",'ANEXO INGRESOS'!O54*'ANEXO GASTOS VARIABLES'!$K$54)","v":""},{"$f":"IF('ANEXO INGRESOS'!$D54=\"\",\"\",'ANEXO INGRESOS'!P54*'ANEXO GASTOS VARIABLES'!$K$54)","v":""},{"$f":"IF('ANEXO INGRESOS'!$D54=\"\",\"\",'ANEXO INGRESOS'!Q54*'ANEXO GASTOS VARIABLES'!$K$54)","v":""},{"$f":"IF('ANEXO INGRESOS'!$D54=\"\",\"\",'ANEXO INGRESOS'!R54*'ANEXO GASTOS VARIABLES'!$K$54)","v":""},{"$f":"IF('ANEXO INGRESOS'!$D54=\"\",\"\",'ANEXO INGRESOS'!S54*'ANEXO GASTOS VARIABLES'!$K$54)","v":""},{"$f":"IF(Gastos_variables_producto9[[#This Row],[MES/PRODUCTO]]=\"\",\"\",SUM('6.GASTOS VARIABLES'!$C138:$O138))","v":""},null,null,null,null,null,null,null,null,null,null,null,null,null,null,null,null,null,null,null,{"$f":"IF(Gastos_variables_producto9[[#This Row],[TOTAL ]]<>\"\",Gastos_variables_producto9[[#This Row],[TOTAL ]],NA())","v":{"$error":"#N/A"}}]
[null,{"$f":"IF(C139=\"\",\"\",'ANEXO INGRESOS'!C55)","v":""},{"$f":"IF('ANEXO INGRESOS'!D55=\"\",\"\",'ANEXO INGRESOS'!D55)","v":""},{"$f":"IF('ANEXO INGRESOS'!$D55=\"\",\"\",'ANEXO INGRESOS'!H55*'ANEXO GASTOS VARIABLES'!$K$54)","v":""},{"$f":"IF('ANEXO INGRESOS'!$D55=\"\",\"\",'ANEXO INGRESOS'!I55*'ANEXO GASTOS VARIABLES'!$K$54)","v":""},{"$f":"IF('ANEXO INGRESOS'!$D55=\"\",\"\",'ANEXO INGRESOS'!J55*'ANEXO GASTOS VARIABLES'!$K$54)","v":""},{"$f":"IF('ANEXO INGRESOS'!$D55=\"\",\"\",'ANEXO INGRESOS'!K55*'ANEXO GASTOS VARIABLES'!$K$54)","v":""},{"$f":"IF('ANEXO INGRESOS'!$D55=\"\",\"\",'ANEXO INGRESOS'!L55*'ANEXO GASTOS VARIABLES'!$K$54)","v":""},{"$f":"IF('ANEXO INGRESOS'!$D55=\"\",\"\",'ANEXO INGRESOS'!M55*'ANEXO GASTOS VARIABLES'!$K$54)","v":""},{"$f":"IF('ANEXO INGRESOS'!$D55=\"\",\"\",'ANEXO INGRESOS'!N55*'ANEXO GASTOS VARIABLES'!$K$54)","v":""},{"$f":"IF('ANEXO INGRESOS'!$D55=\"\",\"\",'ANEXO INGRESOS'!O55*'ANEXO GASTOS VARIABLES'!$K$54)","v":""},{"$f":"IF('ANEXO INGRESOS'!$D55=\"\",\"\",'ANEXO INGRESOS'!P55*'ANEXO GASTOS VARIABLES'!$K$54)","v":""},{"$f":"IF('ANEXO INGRESOS'!$D55=\"\",\"\",'ANEXO INGRESOS'!Q55*'ANEXO GASTOS VARIABLES'!$K$54)","v":""},{"$f":"IF('ANEXO INGRESOS'!$D55=\"\",\"\",'ANEXO INGRESOS'!R55*'ANEXO GASTOS VARIABLES'!$K$54)","v":""},{"$f":"IF('ANEXO INGRESOS'!$D55=\"\",\"\",'ANEXO INGRESOS'!S55*'ANEXO GASTOS VARIABLES'!$K$54)","v":""},{"$f":"IF(Gastos_variables_producto9[[#This Row],[MES/PRODUCTO]]=\"\",\"\",SUM('6.GASTOS VARIABLES'!$C139:$O139))","v":""},null,null,null,null,null,null,null,null,null,null,null,null,null,null,null,null,null,null,null,{"$f":"IF(Gastos_variables_producto9[[#This Row],[TOTAL ]]<>\"\",Gastos_variables_producto9[[#This Row],[TOTAL ]],NA())","v":{"$error":"#N/A"}}]
[null,{"$f":"IF(C140=\"\",\"\",'ANEXO INGRESOS'!C56)","v":""},{"$f":"IF('ANEXO INGRESOS'!D56=\"\",\"\",'ANEXO INGRESOS'!D56)","v":""},{"$f":"IF('ANEXO INGRESOS'!$D56=\"\",\"\",'ANEXO INGRESOS'!H56*'ANEXO GASTOS VARIABLES'!$K$54)","v":""},{"$f":"IF('ANEXO INGRESOS'!$D56=\"\",\"\",'ANEXO INGRESOS'!I56*'ANEXO GASTOS VARIABLES'!$K$54)","v":""},{"$f":"IF('ANEXO INGRESOS'!$D56=\"\",\"\",'ANEXO INGRESOS'!J56*'ANEXO GASTOS VARIABLES'!$K$54)","v":""},{"$f":"IF('ANEXO INGRESOS'!$D56=\"\",\"\",'ANEXO INGRESOS'!K56*'ANEXO GASTOS VARIABLES'!$K$54)","v":""},{"$f":"IF('ANEXO INGRESOS'!$D56=\"\",\"\",'ANEXO INGRESOS'!L56*'ANEXO GASTOS VARIABLES'!$K$54)","v":""},{"$f":"IF('ANEXO INGRESOS'!$D56=\"\",\"\",'ANEXO INGRESOS'!M56*'ANEXO GASTOS VARIABLES'!$K$54)","v":""},{"$f":"IF('ANEXO INGRESOS'!$D56=\"\",\"\",'ANEXO INGRESOS'!N56*'ANEXO GASTOS VARIABLES'!$K$54)","v":""},{"$f":"IF('ANEXO INGRESOS'!$D56=\"\",\"\",'ANEXO INGRESOS'!O56*'ANEXO GASTOS VARIABLES'!$K$54)","v":""},{"$f":"IF('ANEXO INGRESOS'!$D56=\"\",\"\",'ANEXO INGRESOS'!P56*'ANEXO GASTOS VARIABLES'!$K$54)","v":""},{"$f":"IF('ANEXO INGRESOS'!$D56=\"\",\"\",'ANEXO INGRESOS'!Q56*'ANEXO GASTOS VARIABLES'!$K$54)","v":""},{"$f":"IF('ANEXO INGRESOS'!$D56=\"\",\"\",'ANEXO INGRESOS'!R56*'ANEXO GASTOS VARIABLES'!$K$54)","v":""},{"$f":"IF('ANEXO INGRESOS'!$D56=\"\",\"\",'ANEXO INGRESOS'!S56*'ANEXO GASTOS VARIABLES'!$K$54)","v":""},{"$f":"IF(Gastos_variables_producto9[[#This Row],[MES/PRODUCTO]]=\"\",\"\",SUM('6.GASTOS VARIABLES'!$C140:$O140))","v":""},null,null,null,null,null,null,null,null,null,null,null,null,null,null,null,null,null,null,null,{"$f":"IF(Gastos_variables_producto9[[#This Row],[TOTAL ]]<>\"\",Gastos_variables_producto9[[#This Row],[TOTAL ]],NA())","v":{"$error":"#N/A"}}]
[null,{"$f":"IF(C141=\"\",\"\",'ANEXO INGRESOS'!C57)","v":""},{"$f":"IF('ANEXO INGRESOS'!D57=\"\",\"\",'ANEXO INGRESOS'!D57)","v":""},{"$f":"IF('ANEXO INGRESOS'!$D57=\"\",\"\",'ANEXO INGRESOS'!H57*'ANEXO GASTOS VARIABLES'!$K$54)","v":""},{"$f":"IF('ANEXO INGRESOS'!$D57=\"\",\"\",'ANEXO INGRESOS'!I57*'ANEXO GASTOS VARIABLES'!$K$54)","v":""},{"$f":"IF('ANEXO INGRESOS'!$D57=\"\",\"\",'ANEXO INGRESOS'!J57*'ANEXO GASTOS VARIABLES'!$K$54)","v":""},{"$f":"IF('ANEXO INGRESOS'!$D57=\"\",\"\",'ANEXO INGRESOS'!K57*'ANEXO GASTOS VARIABLES'!$K$54)","v":""},{"$f":"IF('ANEXO INGRESOS'!$D57=\"\",\"\",'ANEXO INGRESOS'!L57*'ANEXO GASTOS VARIABLES'!$K$54)","v":""},{"$f":"IF('ANEXO INGRESOS'!$D57=\"\",\"\",'ANEXO INGRESOS'!M57*'ANEXO GASTOS VARIABLES'!$K$54)","v":""},{"$f":"IF('ANEXO INGRESOS'!$D57=\"\",\"\",'ANEXO INGRESOS'!N57*'ANEXO GASTOS VARIABLES'!$K$54)","v":""},{"$f":"IF('ANEXO INGRESOS'!$D57=\"\",\"\",'ANEXO INGRESOS'!O57*'ANEXO GASTOS VARIABLES'!$K$54)","v":""},{"$f":"IF('ANEXO INGRESOS'!$D57=\"\",\"\",'ANEXO INGRESOS'!P57*'ANEXO GASTOS VARIABLES'!$K$54)","v":""},{"$f":"IF('ANEXO INGRESOS'!$D57=\"\",\"\",'ANEXO INGRESOS'!Q57*'ANEXO GASTOS VARIABLES'!$K$54)","v":""},{"$f":"IF('ANEXO INGRESOS'!$D57=\"\",\"\",'ANEXO INGRESOS'!R57*'ANEXO GASTOS VARIABLES'!$K$54)","v":""},{"$f":"IF('ANEXO INGRESOS'!$D57=\"\",\"\",'ANEXO INGRESOS'!S57*'ANEXO GASTOS VARIABLES'!$K$54)","v":""},{"$f":"IF(Gastos_variables_producto9[[#This Row],[MES/PRODUCTO]]=\"\",\"\",SUM('6.GASTOS VARIABLES'!$C141:$O141))","v":""},null,null,null,null,null,null,null,null,null,null,null,null,null,null,null,null,null,null,null,{"$f":"IF(Gastos_variables_producto9[[#This Row],[TOTAL ]]<>\"\",Gastos_variables_producto9[[#This Row],[TOTAL ]],NA())","v":{"$error":"#N/A"}}]
[null,{"$f":"IF(C142=\"\",\"\",'ANEXO INGRESOS'!C58)","v":""},{"$f":"IF('ANEXO INGRESOS'!D58=\"\",\"\",'ANEXO INGRESOS'!D58)","v":""},{"$f":"IF('ANEXO INGRESOS'!$D58=\"\",\"\",'ANEXO INGRESOS'!H58*'ANEXO GASTOS VARIABLES'!$K$54)","v":""},{"$f":"IF('ANEXO INGRESOS'!$D58=\"\",\"\",'ANEXO INGRESOS'!I58*'ANEXO GASTOS VARIABLES'!$K$54)","v":""},{"$f":"IF('ANEXO INGRESOS'!$D58=\"\",\"\",'ANEXO INGRESOS'!J58*'ANEXO GASTOS VARIABLES'!$K$54)","v":""},{"$f":"IF('ANEXO INGRESOS'!$D58=\"\",\"\",'ANEXO INGRESOS'!K58*'ANEXO GASTOS VARIABLES'!$K$54)","v":""},{"$f":"IF('ANEXO INGRESOS'!$D58=\"\",\"\",'ANEXO INGRESOS'!L58*'ANEXO GASTOS VARIABLES'!$K$54)","v":""},{"$f":"IF('ANEXO INGRESOS'!$D58=\"\",\"\",'ANEXO INGRESOS'!M58*'ANEXO GASTOS VARIABLES'!$K$54)","v":""},{"$f":"IF('ANEXO INGRESOS'!$D58=\"\",\"\",'ANEXO INGRESOS'!N58*'ANEXO GASTOS VARIABLES'!$K$54)","v":""},{"$f":"IF('ANEXO INGRESOS'!$D58=\"\",\"\",'ANEXO INGRESOS'!O58*'ANEXO GASTOS VARIABLES'!$K$54)","v":""},{"$f":"IF('ANEXO INGRESOS'!$D58=\"\",\"\",'ANEXO INGRESOS'!P58*'ANEXO GASTOS VARIABLES'!$K$54)","v":""},{"$f":"IF('ANEXO INGRESOS'!$D58=\"\",\"\",'ANEXO INGRESOS'!Q58*'ANEXO GASTOS VARIABLES'!$K$54)","v":""},{"$f":"IF('ANEXO INGRESOS'!$D58=\"\",\"\",'ANEXO INGRESOS'!R58*'ANEXO GASTOS VARIABLES'!$K$54)","v":""},{"$f":"IF('ANEXO INGRESOS'!$D58=\"\",\"\",'ANEXO INGRESOS'!S58*'ANEXO GASTOS VARIABLES'!$K$54)","v":""},{"$f":"IF(Gastos_variables_producto9[[#This Row],[MES/PRODUCTO]]=\"\",\"\",SUM('6.GASTOS VARIABLES'!$C142:$O142))","v":""},null,null,null,null,null,null,null,null,null,null,null,null,null,null,null,null,null,null,null,{"$f":"IF(Gastos_variables_producto9[[#This Row],[TOTAL ]]<>\"\",Gastos_variables_producto9[[#This Row],[TOTAL ]],NA())","v":{"$error":"#N/A"}}]
[null,{"$f":"IF(C143=\"\",\"\",'ANEXO INGRESOS'!C59)","v":""},{"$f":"IF('ANEXO INGRESOS'!D59=\"\",\"\",'ANEXO INGRESOS'!D59)","v":""},{"$f":"IF('ANEXO INGRESOS'!$D59=\"\",\"\",'ANEXO INGRESOS'!H59*'ANEXO GASTOS VARIABLES'!$K$54)","v":""},{"$f":"IF('ANEXO INGRESOS'!$D59=\"\",\"\",'ANEXO INGRESOS'!I59*'ANEXO GASTOS VARIABLES'!$K$54)","v":""},{"$f":"IF('ANEXO INGRESOS'!$D59=\"\",\"\",'ANEXO INGRESOS'!J59*'ANEXO GASTOS VARIABLES'!$K$54)","v":""},{"$f":"IF('ANEXO INGRESOS'!$D59=\"\",\"\",'ANEXO INGRESOS'!K59*'ANEXO GASTOS VARIABLES'!$K$54)","v":""},{"$f":"IF('ANEXO INGRESOS'!$D59=\"\",\"\",'ANEXO INGRESOS'!L59*'ANEXO GASTOS VARIABLES'!$K$54)","v":""},{"$f":"IF('ANEXO INGRESOS'!$D59=\"\",\"\",'ANEXO INGRESOS'!M59*'ANEXO GASTOS VARIABLES'!$K$54)","v":""},{"$f":"IF('ANEXO INGRESOS'!$D59=\"\",\"\",'ANEXO INGRESOS'!N59*'ANEXO GASTOS VARIABLES'!$K$54)","v":""},{"$f":"IF('ANEXO INGRESOS'!$D59=\"\",\"\",'ANEXO INGRESOS'!O59*'ANEXO GASTOS VARIABLES'!$K$54)","v":""},{"$f":"IF('ANEXO INGRESOS'!$D59=\"\",\"\",'ANEXO INGRESOS'!P59*'ANEXO GASTOS VARIABLES'!$K$54)","v":""},{"$f":"IF('ANEXO INGRESOS'!$D59=\"\",\"\",'ANEXO INGRESOS'!Q59*'ANEXO GASTOS VARIABLES'!$K$54)","v":""},{"$f":"IF('ANEXO INGRESOS'!$D59=\"\",\"\",'ANEXO INGRESOS'!R59*'ANEXO GASTOS VARIABLES'!$K$54)","v":""},{"$f":"IF('ANEXO INGRESOS'!$D59=\"\",\"\",'ANEXO INGRESOS'!S59*'ANEXO GASTOS VARIABLES'!$K$54)","v":""},{"$f":"IF(Gastos_variables_producto9[[#This Row],[MES/PRODUCTO]]=\"\",\"\",SUM('6.GASTOS VARIABLES'!$C143:$O143))","v":""},null,null,null,null,null,null,null,null,null,null,null,null,null,null,null,null,null,null,null,{"$f":"IF(Gastos_variables_producto9[[#This Row],[TOTAL ]]<>\"\",Gastos_variables_producto9[[#This Row],[TOTAL ]],NA())","v":{"$error":"#N/A"}}]
[null,{"$f":"IF(C144=\"\",\"\",'ANEXO INGRESOS'!C60)","v":""},{"$f":"IF('ANEXO INGRESOS'!D60=\"\",\"\",'ANEXO INGRESOS'!D60)","v":""},{"$f":"IF('ANEXO INGRESOS'!$D60=\"\",\"\",'ANEXO INGRESOS'!H60*'ANEXO GASTOS VARIABLES'!$K$54)","v":""},{"$f":"IF('ANEXO INGRESOS'!$D60=\"\",\"\",'ANEXO INGRESOS'!I60*'ANEXO GASTOS VARIABLES'!$K$54)","v":""},{"$f":"IF('ANEXO INGRESOS'!$D60=\"\",\"\",'ANEXO INGRESOS'!J60*'ANEXO GASTOS VARIABLES'!$K$54)","v":""},{"$f":"IF('ANEXO INGRESOS'!$D60=\"\",\"\",'ANEXO INGRESOS'!K60*'ANEXO GASTOS VARIABLES'!$K$54)","v":""},{"$f":"IF('ANEXO INGRESOS'!$D60=\"\",\"\",'ANEXO INGRESOS'!L60*'ANEXO GASTOS VARIABLES'!$K$54)","v":""},{"$f":"IF('ANEXO INGRESOS'!$D60=\"\",\"\",'ANEXO INGRESOS'!M60*'ANEXO GASTOS VARIABLES'!$K$54)","v":""},{"$f":"IF('ANEXO INGRESOS'!$D60=\"\",\"\",'ANEXO INGRESOS'!N60*'ANEXO GASTOS VARIABLES'!$K$54)","v":""},{"$f":"IF('ANEXO INGRESOS'!$D60=\"\",\"\",'ANEXO INGRESOS'!O60*'ANEXO GASTOS VARIABLES'!$K$54)","v":""},{"$f":"IF('ANEXO INGRESOS'!$D60=\"\",\"\",'ANEXO INGRESOS'!P60*'ANEXO GASTOS VARIABLES'!$K$54)","v":""},{"$f":"IF('ANEXO INGRESOS'!$D60=\"\",\"\",'ANEXO INGRESOS'!Q60*'ANEXO GASTOS VARIABLES'!$K$54)","v":""},{"$f":"IF('ANEXO INGRESOS'!$D60=\"\",\"\",'ANEXO INGRESOS'!R60*'ANEXO GASTOS VARIABLES'!$K$54)","v":""},{"$f":"IF('ANEXO INGRESOS'!$D60=\"\",\"\",'ANEXO INGRESOS'!S60*'ANEXO GASTOS VARIABLES'!$K$54)","v":""},{"$f":"IF(Gastos_variables_producto9[[#This Row],[MES/PRODUCTO]]=\"\",\"\",SUM('6.GASTOS VARIABLES'!$C144:$O144))","v":""},null,null,null,null,null,null,null,null,null,null,null,null,null,null,null,null,null,null,null,{"$f":"IF(Gastos_variables_producto9[[#This Row],[TOTAL ]]<>\"\",Gastos_variables_producto9[[#This Row],[TOTAL ]],NA())","v":{"$error":"#N/A"}}]
[null,{"$f":"IF(C145=\"\",\"\",'ANEXO INGRESOS'!C61)","v":""},{"$f":"IF('ANEXO INGRESOS'!D61=\"\",\"\",'ANEXO INGRESOS'!D61)","v":""},{"$f":"IF('ANEXO INGRESOS'!$D61=\"\",\"\",'ANEXO INGRESOS'!H61*'ANEXO GASTOS VARIABLES'!$K$54)","v":""},{"$f":"IF('ANEXO INGRESOS'!$D61=\"\",\"\",'ANEXO INGRESOS'!I61*'ANEXO GASTOS VARIABLES'!$K$54)","v":""},{"$f":"IF('ANEXO INGRESOS'!$D61=\"\",\"\",'ANEXO INGRESOS'!J61*'ANEXO GASTOS VARIABLES'!$K$54)","v":""},{"$f":"IF('ANEXO INGRESOS'!$D61=\"\",\"\",'ANEXO INGRESOS'!K61*'ANEXO GASTOS VARIABLES'!$K$54)","v":""},{"$f":"IF('ANEXO INGRESOS'!$D61=\"\",\"\",'ANEXO INGRESOS'!L61*'ANEXO GASTOS VARIABLES'!$K$54)","v":""},{"$f":"IF('ANEXO INGRESOS'!$D61=\"\",\"\",'ANEXO INGRESOS'!M61*'ANEXO GASTOS VARIABLES'!$K$54)","v":""},{"$f":"IF('ANEXO INGRESOS'!$D61=\"\",\"\",'ANEXO INGRESOS'!N61*'ANEXO GASTOS VARIABLES'!$K$54)","v":""},{"$f":"IF('ANEXO INGRESOS'!$D61=\"\",\"\",'ANEXO INGRESOS'!O61*'ANEXO GASTOS VARIABLES'!$K$54)","v":""},{"$f":"IF('ANEXO INGRESOS'!$D61=\"\",\"\",'ANEXO INGRESOS'!P61*'ANEXO GASTOS VARIABLES'!$K$54)","v":""},{"$f":"IF('ANEXO INGRESOS'!$D61=\"\",\"\",'ANEXO INGRESOS'!Q61*'ANEXO GASTOS VARIABLES'!$K$54)","v":""},{"$f":"IF('ANEXO INGRESOS'!$D61=\"\",\"\",'ANEXO INGRESOS'!R61*'ANEXO GASTOS VARIABLES'!$K$54)","v":""},{"$f":"IF('ANEXO INGRESOS'!$D61=\"\",\"\",'ANEXO INGRESOS'!S61*'ANEXO GASTOS VARIABLES'!$K$54)","v":""},{"$f":"IF(Gastos_variables_producto9[[#This Row],[MES/PRODUCTO]]=\"\",\"\",SUM('6.GASTOS VARIABLES'!$C145:$O145))","v":""}]
[null,null,"TOTAL",{"$f":"+SUM(Gastos_variables_producto9[[Mes 1 ]])","v":0},{"$f":"+SUM(Gastos_variables_producto9[[Mes 1 ]])","v":0},{"$f":"+SUM(Gastos_variables_producto9[[Mes 1 ]])","v":0},{"$f":"+SUM(Gastos_variables_producto9[[Mes 1 ]])","v":0},{"$f":"+SUM(Gastos_variables_producto9[[Mes 1 ]])","v":0},{"$f":"+SUM(Gastos_variables_producto9[[Mes 1 ]])","v":0},{"$f":"+SUM(Gastos_variables_producto9[[Mes 1 ]])","v":0},{"$f":"+SUM(Gastos_variables_producto9[[Mes 1 ]])","v":0},{"$f":"+SUM(Gastos_variables_producto9[[Mes 1 ]])","v":0},{"$f":"+SUM(Gastos_variables_producto9[[Mes 1 ]])","v":0},{"$f":"+SUM(Gastos_variables_producto9[[Mes 1 ]])","v":0},{"$f":"+SUM(Gastos_variables_producto9[[Mes 1 ]])","v":0},{"$f":"+SUM(Gastos_variables_producto9[[Mes 1 ]])","v":0}]
[]
[]
[]
[]
[]
[null,"IVA","MES/PRODUCTO","TOTAL AÑO 1 ","TOTAL AÑO 2 ","TOTAL AÑO 3 ","TOTAL AÑO 4 "]
[null,{"$f":"IF(C135=\"\",\"\",B135)","v":""},{"$f":"IF(C135=\"\",\"\",C135)","v":""},{"$f":"IF(Totales_años8[[#This Row],[MES/PRODUCTO]]=\"\",\"\",P135)","v":""},{"$f":"IF(Totales_años8[[#This Row],[TOTAL AÑO 1 ]]=\"\",\"\",Totales_años8[[#This Row],[TOTAL AÑO 1 ]]*$E$19+Totales_años8[[#This Row],[TOTAL AÑO 1 ]])","v":""},{"$f":"IF(Totales_años8[[#This Row],[TOTAL AÑO 1 ]]=\"\",\"\",Totales_años8[[#This Row],[TOTAL AÑO 1 ]]*$F$19+Totales_años8[[#This Row],[TOTAL AÑO 1 ]])","v":""},{"$f":"IF(Totales_años8[[#This Row],[TOTAL AÑO 1 ]]=\"\",\"\",Totales_años8[[#This Row],[TOTAL AÑO 1 ]]*$G$19+Totales_años8[[#This Row],[TOTAL AÑO 1 ]])","v":""}]
[null,"","",{"$f":"IF(Totales_años8[[#This Row],[MES/PRODUCTO]]=\"\",\"\",P136)","v":""},{"$f":"IF(Totales_años8[[#This Row],[TOTAL AÑO 1 ]]=\"\",\"\",Totales_años8[[#This Row],[TOTAL AÑO 1 ]]*$E$19+Totales_años8[[#This Row],[TOTAL AÑO 1 ]])","v":""},{"$f":"IF(Totales_años8[[#This Row],[TOTAL AÑO 1 ]]=\"\",\"\",Totales_años8[[#This Row],[TOTAL AÑO 1 ]]*$F$19+Totales_años8[[#This Row],[TOTAL AÑO 1 ]])","v":""},{"$f":"IF(Totales_años8[[#This Row],[TOTAL AÑO 1 ]]=\"\",\"\",Totales_años8[[#This Row],[TOTAL AÑO 1 ]]*$G$19+Totales_años8[[#This Row],[TOTAL AÑO 1 ]])","v":""}]
[null,"","",{"$f":"IF(Totales_años8[[#This Row],[MES/PRODUCTO]]=\"\",\"\",P137)","v":""},{"$f":"IF(Totales_años8[[#This Row],[TOTAL AÑO 1 ]]=\"\",\"\",Totales_años8[[#This Row],[TOTAL AÑO 1 ]]*$E$19+Totales_años8[[#This Row],[TOTAL AÑO 1 ]])","v":""},{"$f":"IF(Totales_años8[[#This Row],[TOTAL AÑO 1 ]]=\"\",\"\",Totales_años8[[#This Row],[TOTAL AÑO 1 ]]*$F$19+Totales_años8[[#This Row],[TOTAL AÑO 1 ]])","v":""},{"$f":"IF(Totales_años8[[#This Row],[TOTAL AÑO 1 ]]=\"\",\"\",Totales_años8[[#This Row],[TOTAL AÑO 1 ]]*$G$19+Totales_años8[[#This Row],[TOTAL AÑO 1 ]])","v":""}]
[null,"","",{"$f":"IF(Totales_años8[[#This Row],[MES/PRODUCTO]]=\"\",\"\",P138)","v":""},{"$f":"IF(Totales_años8[[#This Row],[TOTAL AÑO 1 ]]=\"\",\"\",Totales_años8[[#This Row],[TOTAL AÑO 1 ]]*$E$19+Totales_años8[[#This Row],[TOTAL AÑO 1 ]])","v":""},{"$f":"IF(Totales_años8[[#This Row],[TOTAL AÑO 1 ]]=\"\",\"\",Totales_años8[[#This Row],[TOTAL AÑO 1 ]]*$F$19+Totales_años8[[#This Row],[TOTAL AÑO 1 ]])","v":""},{"$f":"IF(Totales_años8[[#This Row],[TOTAL AÑO 1 ]]=\"\",\"\",Totales_años8[[#This Row],[TOTAL AÑO 1 ]]*$G$19+Totales_años8[[#This Row],[TOTAL AÑO 1 ]])","v":""}]
[null,"","",{"$f":"IF(Totales_años8[[#This Row],[MES/PRODUCTO]]=\"\",\"\",P139)","v":""},{"$f":"IF(Totales_años8[[#This Row],[TOTAL AÑO 1 ]]=\"\",\"\",Totales_años8[[#This Row],[TOTAL AÑO 1 ]]*$E$19+Totales_años8[[#This Row],[TOTAL AÑO 1 ]])","v":""},{"$f":"IF(Totales_años8[[#This Row],[TOTAL AÑO 1 ]]=\"\",\"\",Totales_años8[[#This Row],[TOTAL AÑO 1 ]]*$F$19+Totales_años8[[#This Row],[TOTAL AÑO 1 ]])","v":""},{"$f":"IF(Totales_años8[[#This Row],[TOTAL AÑO 1 ]]=\"\",\"\",Totales_años8[[#This Row],[TOTAL AÑO 1 ]]*$G$19+Totales_años8[[#This Row],[TOTAL AÑO 1 ]])","v":""}]
[null,"","",{"$f":"IF(Totales_años8[[#This Row],[MES/PRODUCTO]]=\"\",\"\",P140)","v":""},{"$f":"IF(Totales_años8[[#This Row],[TOTAL AÑO 1 ]]=\"\",\"\",Totales_años8[[#This Row],[TOTAL AÑO 1 ]]*$E$19+Totales_años8[[#This Row],[TOTAL AÑO 1 ]])","v":""},{"$f":"IF(Totales_años8[[#This Row],[TOTAL AÑO 1 ]]=\"\",\"\",Totales_años8[[#This Row],[TOTAL AÑO 1 ]]*$F$19+Totales_años8[[#This Row],[TOTAL AÑO 1 ]])","v":""},{"$f":"IF(Totales_años8[[#This Row],[TOTAL AÑO 1 ]]=\"\",\"\",Totales_años8[[#This Row],[TOTAL AÑO 1 ]]*$G$19+Totales_años8[[#This Row],[TOTAL AÑO 1 ]])","v":""}]
[null,"","",{"$f":"IF(Totales_años8[[#This Row],[MES/PRODUCTO]]=\"\",\"\",P141)","v":""},{"$f":"IF(Totales_años8[[#This Row],[TOTAL AÑO 1 ]]=\"\",\"\",Totales_años8[[#This Row],[TOTAL AÑO 1 ]]*$E$19+Totales_años8[[#This Row],[TOTAL AÑO 1 ]])","v":""},{"$f":"IF(Totales_años8[[#This Row],[TOTAL AÑO 1 ]]=\"\",\"\",Totales_años8[[#This Row],[TOTAL AÑO 1 ]]*$F$19+Totales_años8[[#This Row],[TOTAL AÑO 1 ]])","v":""},{"$f":"IF(Totales_años8[[#This Row],[TOTAL AÑO 1 ]]=\"\",\"\",Totales_años8[[#This Row],[TOTAL AÑO 1 ]]*$G$19+Totales_años8[[#This Row],[TOTAL AÑO 1 ]])","v":""}]
[null,"","",{"$f":"IF(Totales_años8[[#This Row],[MES/PRODUCTO]]=\"\",\"\",P142)","v":""},{"$f":"IF(Totales_años8[[#This Row],[TOTAL AÑO 1 ]]=\"\",\"\",Totales_años8[[#This Row],[TOTAL AÑO 1 ]]*$E$19+Totales_años8[[#This Row],[TOTAL AÑO 1 ]])","v":""},{"$f":"IF(Totales_años8[[#This Row],[TOTAL AÑO 1 ]]=\"\",\"\",Totales_años8[[#This Row],[TOTAL AÑO 1 ]]*$F$19+Totales_años8[[#This Row],[TOTAL AÑO 1 ]])","v":""},{"$f":"IF(Totales_años8[[#This Row],[TOTAL AÑO 1 ]]=\"\",\"\",Totales_años8[[#This Row],[TOTAL AÑO 1 ]]*$G$19+Totales_años8[[#This Row],[TOTAL AÑO 1 ]])","v":""}]
[null,"","",{"$f":"IF(Totales_años8[[#This Row],[MES/PRODUCTO]]=\"\",\"\",P143)","v":""},{"$f":"IF(Totales_años8[[#This Row],[TOTAL AÑO 1 ]]=\"\",\"\",Totales_años8[[#This Row],[TOTAL AÑO 1 ]]*$E$19+Totales_años8[[#This Row],[TOTAL AÑO 1 ]])","v":""},{"$f":"IF(Totales_años8[[#This Row],[TOTAL AÑO 1 ]]=\"\",\"\",Totales_años8[[#This Row],[TOTAL AÑO 1 ]]*$F$19+Totales_años8[[#This Row],[TOTAL AÑO 1 ]])","v":""},{"$f":"IF(Totales_años8[[#This Row],[TOTAL AÑO 1 ]]=\"\",\"\",Totales_años8[[#This Row],[TOTAL AÑO 1 ]]*$G$19+Totales_años8[[#This Row],[TOTAL AÑO 1 ]])","v":""}]
[null,"","",{"$f":"IF(Totales_años8[[#This Row],[MES/PRODUCTO]]=\"\",\"\",P144)","v":""},{"$f":"IF(Totales_años8[[#This Row],[TOTAL AÑO 1 ]]=\"\",\"\",Totales_años8[[#This Row],[TOTAL AÑO 1 ]]*$E$19+Totales_años8[[#This Row],[TOTAL AÑO 1 ]])","v":""},{"$f":"IF(Totales_años8[[#This Row],[TOTAL AÑO 1 ]]=\"\",\"\",Totales_años8[[#This Row],[TOTAL AÑO 1 ]]*$F$19+Totales_años8[[#This Row],[TOTAL AÑO 1 ]])","v":""},{"$f":"IF(Totales_años8[[#This Row],[TOTAL AÑO 1 ]]=\"\",\"\",Totales_años8[[#This Row],[TOTAL AÑO 1 ]]*$G$19+Totales_años8[[#This Row],[TOTAL AÑO 1 ]])","v":""}]
[null,"","",{"$f":"IF(Totales_años8[[#This Row],[MES/PRODUCTO]]=\"\",\"\",P145)","v":""},{"$f":"IF(Totales_años8[[#This Row],[TOTAL AÑO 1 ]]=\"\",\"\",Totales_años8[[#This Row],[TOTAL AÑO 1 ]]*$E$19+Totales_años8[[#This Row],[TOTAL AÑO 1 ]])","v":""},{"$f":"IF(Totales_años8[[#This Row],[TOTAL AÑO 1 ]]=\"\",\"\",Totales_años8[[#This Row],[TOTAL AÑO 1 ]]*$F$19+Totales_años8[[#This Row],[TOTAL AÑO 1 ]])","v":""},{"$f":"IF(Totales_años8[[#This Row],[TOTAL AÑO 1 ]]=\"\",\"\",Totales_años8[[#This Row],[TOTAL AÑO 1 ]]*$G$19+Totales_años8[[#This Row],[TOTAL AÑO 1 ]])","v":""}]
[null,null,"TOTAL",{"$f":"SUM(D153:D163)","v":0},{"$f":"SUM(E153:E163)","v":0},{"$f":"SUM(F153:F163)","v":0},{"$f":"SUM(G153:G163)","v":0}]

{"sheet":"7.CUENTA DE RESULTADOS ","index":14,"n_rows":68,"n_cols":18,"rows_kept":68,"cut":false,"hidden":false,"merged":[[56,7,56,8],[57,7,57,8],[58,7,58,8]]}
[]
[null,"Volver al Indice ",{"$f":"YEAR(C3)","v":1900},{"$f":"YEAR(D3)","v":1900},1900,1900,1900,1900,1900,1900,1900,1900,1900,1900]
[null,null,{"$f":"DATE(YEAR('2.PROYECTO'!$B$11),MONTH('2.PROYECTO'!$B$11),DAY('2.PROYECTO'!$B$11))","v":0},{"$f":"IF(MONTH('2.PROYECTO'!$B$11)+1>12,DATE(YEAR('2.PROYECTO'!$B$11)+1,MONTH('2.PROYECTO'!$B$11)+1-12,DAY('2.PROYECTO'!$B$11)),DATE(YEAR('2.PROYECTO'!$B$11),MONTH('2.PROYECTO'!$B$11)+1,DAY('2.PROYECTO'!$B$11)))","v":31},{"$f":"IF(MONTH('2.PROYECTO'!$B$11)+2>12,DATE(YEAR('2.PROYECTO'!$B$11)+1,MONTH('2.PROYECTO'!$B$11)+2-12,DAY('2.PROYECTO'!$B$11)),DATE(YEAR('2.PROYECTO'!$B$11),MONTH('2.PROYECTO'!$B$11)+2,DAY('2.PROYECTO'!$B$11)))","v":60},{"$f":"IF(MONTH('2.PROYECTO'!$B$11)+3>12,DATE(YEAR('2.PROYECTO'!$B$11)+1,MONTH('2.PROYECTO'!$B$11)+3-12,DAY('2.PROYECTO'!$B$11)),DATE(YEAR('2.PROYECTO'!$B$11),MONTH('2.PROYECTO'!$B$11)+3,DAY('2.PROYECTO'!$B$11)))","v":91},{"$f":"IF(MONTH('2.PROYECTO'!$B$11)+4>12,DATE(YEAR('2.PROYECTO'!$B$11)+1,MONTH('2.PROYECTO'!$B$11)+4-12,DAY('2.PROYECTO'!$B$11)),DATE(YEAR('2.PROYECTO'!$B$11),MONTH('2.PROYECTO'!$B$11)+4,DAY('2.PROYECTO'!$B$11)))","v":121},{"$f":"IF(MONTH('2.PROYECTO'!$B$11)+5>12,DATE(YEAR('2.PROYECTO'!$B$11)+1,MONTH('2.PROYECTO'!$B$11)+5-12,DAY('2.PROYECTO'!$B$11)),DATE(YEAR('2.PROYECTO'!$B$11),MONTH('2.PROYECTO'!$B$11)+5,DAY('2.PROYECTO'!$B$11)))","v":152},{"$f":"IF(MONTH('2.PROYECTO'!$B$11)+6>12,DATE(YEAR('2.PROYECTO'!$B$11)+1,MONTH('2.PROYECTO'!$B$11)+6-12,DAY('2.PROYECTO'!$B$11)),DATE(YEAR('2.PROYECTO'!$B$11),MONTH('2.PROYECTO'!$B$11)+6,DAY('2.PROYECTO'!$B$11)))","v":182},{"$f":"IF(MONTH('2.PROYECTO'!$B$11)+7>12,DATE(YEAR('2.PROYECTO'!$B$11)+1,MONTH('2.PROYECTO'!$B$11)+7-12,DAY('2.PROYECTO'!$B$11)),DATE(YEAR('2.PROYECTO'!$B$11),MONTH('2.PROYECTO'!$B$11)+7,DAY('2.PROYECTO'!$B$11)))","v":213},{"$f":"IF(MONTH('2.PROYECTO'!$B$11)+8>12,DATE(YEAR('2.PROYECTO'!$B$11)+1,MONTH('2.PROYECTO'!$B$11)+8-12,DAY('2.PROYECTO'!$B$11)),DATE(YEAR('2.PROYECTO'!$B$11),MONTH('2.PROYECTO'!$B$11)+8,DAY('2.PROYECTO'!$B$11)))","v":244},{"$f":"IF(MONTH('2.PROYECTO'!$B$11)+9>12,DATE(YEAR('2.PROYECTO'!$B$11)+1,MONTH('2.PROYECTO'!$B$11)+9-12,DAY('2.PROYECTO'!$B$11)),DATE(YEAR('2.PROYECTO'!$B$11),MONTH('2.PROYECTO'!$B$11)+9,DAY('2.PROYECTO'!$B$11)))","v":274},{"$f":"IF(MONTH('2.PROYECTO'!$B$11)+10>12,DATE(YEAR('2.PROYECTO'!$B$11)+1,MONTH('2.PROYECTO'!$B$11)+10-12,DAY('2.PROYECTO'!$B$11)),DATE(YEAR('2.PROYECTO'!$B$11),MONTH('2.PROYECTO'!$B$11)+10,DAY('2.PROYECTO'!$B$11)))","v":305},{"$f":"IF(MONTH('2.PROYECTO'!$B$11)+11>12,DATE(YEAR('2.PROYECTO'!$B$11)+1,MONTH('2.PROYECTO'!$B$11)+11-12,DAY('2.PROYECTO'!$B$11)),DATE(YEAR('2.PROYECTO'!$B$11),MONTH('2.PROYECTO'!$B$11)+11,DAY('2.PROYECTO'!$B$11)))","v":335}]
[null,null,{"$f":"MONTH(C3)","v":1},{"$f":"MONTH(D3)","v":1},2,3,4,5,6,7,8,9,10,11]
[]
[]
[]
[]
[null,null,{"$f":"TEXT(C3,\"mmmm\")","v":"enero"},{"$f":"TEXT(D3,\"mmmm\")","v":"enero"},{"$f":"TEXT(E3,\"mmmm\")","v":"febrero"},"marzo","abril","mayo","junio","julio","agosto","septiembre","octubre","noviembre"]
[]
[null,"Cuenta de Resultados"]
[]
[]
[null,"GASTOS"]
[]
[null,null,null,null,null,null,null,null,null,null,null,null,null,null,null,"De año 1 a año 2","De año 2 a año 3","De año 3 a año 4"]
[null,null,null,null,null,null,null,null,null,null,null,null,null," INCREMENTO/REDUCCIÓN GASTOS FIJOS INTERANUAL EN %",null,{"$f":"+'5.GASTOS FIJOS'!F17","v":0},{"$f":"+'5.GASTOS FIJOS'!G17","v":0},{"$f":"+'5.GASTOS FIJOS'!H17","v":0}]
[null,null,null,null,null,null,null,null,null,null,null,null,null," INCREMENTO/REDUCCIÓN GASTOS VARIABLES INTERANUAL EN %",null,{"$f":"+'6.GASTOS VARIABLES'!E19","v":0},{"$f":"+'6.GASTOS VARIABLES'!F19","v":0},{"$f":"+'6.GASTOS VARIABLES'!G19","v":0}]
[null,null,{"$f":"'2.PROYECTO'!$B$11","v":0},{"$f":"'2.PROYECTO'!$B$11","v":0},{"$f":"'2.PROYECTO'!$B$11","v":0},{"$f":"'2.PROYECTO'!$B$11","v":0},{"$f":"'2.PROYECTO'!$B$11","v":0},{"$f":"'2.PROYECTO'!$B$11","v":0},{"$f":"'2.PROYECTO'!$B$11","v":0},{"$f":"'2.PROYECTO'!$B$11","v":0},{"$f":"'2.PROYECTO'!$B$11","v":0},{"$f":"'2.PROYECTO'!$B$11","v":0},{"$f":"'2.PROYECTO'!$B$11","v":0},{"$f":"'2.PROYECTO'!$B$11","v":0}]
[null,null,{"$f":"YEAR(C3)&C9","v":"1900enero"},{"$f":"YEAR(D3)&D9","v":"1900enero"},"1900febrero","1900marzo","1900abril","1900mayo","1900junio","1900julio","1900agosto","1900septiembre","1900octubre","1900noviembre","AÑO 1","AÑO 2","AÑO 3","AÑO 4 "]
[null,"GASTOS FIJOS",{"$f":"'ANEXO GASTOS FIJOS'!D42","v":0},{"$f":"'ANEXO GASTOS FIJOS'!E42","v":0},{"$f":"'ANEXO GASTOS FIJOS'!F42","v":0},{"$f":"'ANEXO GASTOS FIJOS'!G42","v":0},{"$f":"'ANEXO GASTOS FIJOS'!H42","v":0},{"$f":"'ANEXO GASTOS FIJOS'!I42","v":0},{"$f":"'ANEXO GASTOS FIJOS'!J42","v":0},{"$f":"'ANEXO GASTOS FIJOS'!K42","v":0},{"$f":"'ANEXO GASTOS FIJOS'!L42","v":0},{"$f":"'ANEXO GASTOS FIJOS'!M42","v":0},{"$f":"'ANEXO GASTOS FIJOS'!N42","v":0},{"$f":"'ANEXO GASTOS FIJOS'!O42","v":0},{"$f":"+SUM(C21:N21)","v":0},{"$f":"O21*P17+O21","v":0},0,0]
[null,"GASTOS VARIABLES",{"$f":"'6.GASTOS VARIABLES'!D52+'6.GASTOS VARIABLES'!D146","v":0},{"$f":"'6.GASTOS VARIABLES'!E52+'6.GASTOS VARIABLES'!E146","v":0},{"$f":"'6.GASTOS VARIABLES'!F52+'6.GASTOS VARIABLES'!F146","v":0},{"$f":"'6.GASTOS VARIABLES'!G52+'6.GASTOS VARIABLES'!G146","v":0},{"$f":"'6.GASTOS VARIABLES'!H52+'6.GASTOS VARIABLES'!H146","v":0},{"$f":"'6.GASTOS VARIABLES'!I52+'6.GASTOS VARIABLES'!I146","v":0},{"$f":"'6.GASTOS VARIABLES'!J52+'6.GASTOS VARIABLES'!J146","v":0},{"$f":"'6.GASTOS VARIABLES'!K52+'6.GASTOS VARIABLES'!K146","v":0},{"$f":"'6.GASTOS VARIABLES'!L52+'6.GASTOS VARIABLES'!L146","v":0},{"$f":"'6.GASTOS VARIABLES'!M52+'6.GASTOS VARIABLES'!M146","v":0},{"$f":"'6.GASTOS VARIABLES'!N52+'6.GASTOS VARIABLES'!N146","v":0},{"$f":"'6.GASTOS VARIABLES'!O52+'6.GASTOS VARIABLES'!O146","v":0},{"$f":"+SUM(C22:N22)","v":0},0,0,0]
[null,"TOTAL GASTOS ",{"$f":"SUM(C21:C22)","v":0},0,0,0,0,0,0,0,0,0,0,0,0,0,0,0]
[]
[null,"INGRESOS"]
[]
[null,null,null,null,null,null,null,null,null,null,null,null,null,null,null,"De año 1 a año 2","De año 2 a año 3","De año 3 a año 4"]
[null,null,null,null,null,null,null,null,null,null,null,null,null," INCREMENTO/REDUCCIÓN INGRESOS INTERANUAL EN %",null,{"$f":"'ANEXO INGRESOS'!C9","v":0},{"$f":"'ANEXO INGRESOS'!D9","v":0},{"$f":"'ANEXO INGRESOS'!E9","v":0}]
[null,null,1,2,3,4,5,6,7,8,9,10,11,12]
[null,null,{"$f":"C20","v":"1900enero"},"1900enero","1900febrero","1900marzo","1900abril","1900mayo","1900junio","1900julio","1900agosto","1900septiembre","1900octubre","1900noviembre","AÑO 1","AÑO 2","AÑO 3","AÑO 4 "]
[null,"INGRESOS POR VENTAS",{"$f":"+'4.INGRESOS'!D13","v":0},{"$f":"+'4.INGRESOS'!E13","v":0},{"$f":"+'4.INGRESOS'!F13","v":0},{"$f":"+'4.INGRESOS'!G13","v":0},{"$f":"+'4.INGRESOS'!H13","v":0},{"$f":"+'4.INGRESOS'!I13","v":0},{"$f":"+'4.INGRESOS'!J13","v":0},{"$f":"+'4.INGRESOS'!K13","v":0},{"$f":"+'4.INGRESOS'!L13","v":0},{"$f":"+'4.INGRESOS'!M13","v":0},{"$f":"+'4.INGRESOS'!N13","v":0},{"$f":"+'4.INGRESOS'!O13","v":0},{"$f":"+SUM(C31:N31)","v":0},{"$f":"O31*P28+O31","v":0},{"$f":"P31*Q28+P31","v":0},{"$f":"Q31*R28+Q31","v":0}]
[null,"OTROS INGRESOS",{"$f":"+'4.INGRESOS'!D14","v":0},{"$f":"+'4.INGRESOS'!E14","v":0},{"$f":"+'4.INGRESOS'!F14","v":0},{"$f":"+'4.INGRESOS'!G14","v":0},{"$f":"+'4.INGRESOS'!H14","v":0},{"$f":"+'4.INGRESOS'!I14","v":0},{"$f":"+'4.INGRESOS'!J14","v":0},{"$f":"+'4.INGRESOS'!K14","v":0},{"$f":"+'4.INGRESOS'!L14","v":0},{"$f":"+'4.INGRESOS'!M14","v":0},{"$f":"+'4.INGRESOS'!N14","v":0},{"$f":"+'4.INGRESOS'!O14","v":0},{"$f":"+SUM(C32:N32)","v":0},{"$f":"O32*P28+O32","v":0},{"$f":"P32*Q28+P32","v":0},{"$f":"Q32*R28+Q32","v":0}]
[null,"TOTAL INGRESOS",{"$f":"+C31+C32","v":0},0,0,0,0,0,0,0,0,0,0,0,{"$f":"+SUM(C33:N33)","v":0},{"$f":"+P31+P32","v":0},{"$f":"+Q31+Q32","v":0},{"$f":"+R31+R32","v":0}]
[]
[]
[]
[null,"CUENTA DE RESULTADOS"]
[null,null,1,2,3,4,5,6,7,8,9,10,11,12]
[null,null,{"$f":"C20","v":"1900enero"},"1900enero","1900febrero","1900marzo","1900abril","1900mayo","1900junio","1900julio","1900agosto","1900septiembre","1900octubre","1900noviembre","AÑO 1","AÑO 2","AÑO 3","AÑO 4 "]
[null,"INGRESOS POR VENTAS",{"$f":"+C31","v":0},{"$f":"+D31","v":0},0,0,0,0,0,0,0,0,0,0,{"$f":"+O31","v":0},0,0,{"$f":"+R31","v":0}]
[null,"GASTOS VARIABLES",{"$f":"+C22","v":0},0,0,0,0,0,0,0,0,0,0,0,0,0,0,{"$f":"+R22","v":0}]
[null,"MARGEN BRUTO",{"$f":"C40-C41","v":0},0,0,0,0,0,0,0,0,0,0,0,0,0,0,{"$f":"R40-R41","v":0}]
[null,"OTROS INGRESOS",{"$f":"+C32","v":0},0,0,0,0,0,0,0,0,0,0,0,0,0,0,{"$f":"+R32","v":0}]
[null,"GASTOS FIJOS",{"$f":"+C$21","v":0},{"$f":"+D$21","v":0},0,0,0,0,0,0,0,0,0,0,{"$f":"+O$21","v":0},{"$f":"+P$21","v":0},{"$f":"+Q$21","v":0},{"$f":"+R$21","v":0}]
[null,"EBITDA",{"$f":"C42+C43-C44","v":0},0,0,0,0,0,0,0,0,0,0,0,0,0,0,{"$f":"R42+R43-R44","v":0}]
[null,"CUOTA DE PRESTAMO ",{"$f":"+'ANEXO FINANCIACIÓN'!G24","v":""},{"$f":"+C46","v":""},{"$f":"+D46","v":""},"","","","","","","","","",{"$f":"SUM(C46:N46)","v":0},{"$f":"O46","v":0},{"$f":"P46","v":0},{"$f":"Q46","v":0}]
[null,"BAI",{"$f":"+C45-C46","v":{"$error":"#VALUE!"}},{"$error":"#VALUE!"},{"$error":"#VALUE!"},{"$error":"#VALUE!"},{"$error":"#VALUE!"},{"$error":"#VALUE!"},{"$error":"#VALUE!"},{"$error":"#VALUE!"},{"$error":"#VALUE!"},{"$error":"#VALUE!"},{"$error":"#VALUE!"},{"$error":"#VALUE!"},0,0,0,{"$f":"+R45-R46","v":0}]
[null,"IMPUESTO S/ BENEFICIOS ",{"$f":"+IF(C47<0,0,C47*'2.PROYECTO'!$F$11)","v":{"$error":"#VALUE!"}},{"$f":"+IF(D47<0,0,D47*'2.PROYECTO'!$F$11)","v":{"$error":"#VALUE!"}},{"$f":"+IF(E47<0,0,E47*'2.PROYECTO'!$F$11)","v":{"$error":"#VALUE!"}},{"$f":"+IF(F47<0,0,F47*'2.PROYECTO'!$F$11)","v":{"$error":"#VALUE!"}},{"$f":"+IF(G47<0,0,G47*'2.PROYECTO'!$F$11)","v":{"$error":"#VALUE!"}},{"$f":"+IF(H47<0,0,H47*'2.PROYECTO'!$F$11)","v":{"$error":"#VALUE!"}},{"$f":"+IF(I47<0,0,I47*'2.PROYECTO'!$F$11)","v":{"$error":"#VALUE!"}},{"$f":"+IF(J47<0,0,J47*'2.PROYECTO'!$F$11)","v":{"$error":"#VALUE!"}},{"$f":"+IF(K47<0,0,K47*'2.PROYECTO'!$F$11)","v":{"$error":"#VALUE!"}},{"$f":"+IF(L47<0,0,L47*'2.PROYECTO'!$F$11)","v":{"$error":"#VALUE!"}},{"$f":"+IF(M47<0,0,M47*'2.PROYECTO'!$F$11)","v":{"$error":"#VALUE!"}},{"$f":"+IF(N47<0,0,N47*'2.PROYECTO'!$F$11)","v":{"$error":"#VALUE!"}},{"$f":"+IF(O47<0,0,O47*'2.PROYECTO'!$F$11)","v":0},{"$f":"+IF(P47<0,0,P47*'2.PROYECTO'!$F$11)","v":0},{"$f":"+IF(Q47<0,0,Q47*'2.PROYECTO'!$F$11)","v":0},{"$f":"+IF(R47<0,0,R47*'2.PROYECTO'!$F$11)","v":0}]
[null,"BENEFICIO NETO (RESULTADO)",{"$f":"+C47-C48","v":{"$error":"#VALUE!"}},{"$error":"#VALUE!"},{"$error":"#VALUE!"},{"$error":"#VALUE!"},{"$error":"#VALUE!"},{"$error":"#VALUE!"},{"$error":"#VALUE!"},{"$error":"#VALUE!"},{"$error":"#VALUE!"},{"$error":"#VALUE!"},{"$error":"#VALUE!"},{"$error":"#VALUE!"},0,0,0,0]
[]
[]
[null,"RESUMEN"]
[]
[null,"RESUMEN GASTOS",null,null,null,null,null,"RESUMEN INGRESOS"]
[]
[null,null,"AÑO 1","AÑO 2","AÑO 3","AÑO 4",null,"INGRESOS    ",null,"AÑO 1","AÑO 2","AÑO 3","AÑO 4"]
[null,"GASTOS FIJOS",{"$f":"+$O$21","v":0},{"$f":"+$P$21","v":0},{"$f":"+$Q$21","v":0},{"$f":"+$R$21","v":0},null,"INGRESOS VENTAS",null,{"$f":"+O31","v":0},0,0,0]
[null,"GASTOS VARIABLES",{"$f":"+O22","v":0},{"$f":"+P22","v":0},{"$f":"+Q22","v":0},{"$f":"+R22","v":0},null,"OTROS INGRESOS",null,0,0,0,0]
[null,"TOTAL",{"$f":"SUM(C57:C58)","v":0},{"$f":"SUM(D57:D58)","v":0},{"$f":"SUM(E57:E58)","v":0},{"$f":"SUM(F57:F58)","v":0},null,"TOTAL",null,{"$f":"SUM(J56:J58)","v":0},{"$f":"SUM(K56:K58)","v":0},{"$f":"SUM(L56:L58)","v":0},{"$f":"SUM(M56:M58)","v":0}]
[]
[]
[null,"CUENTA DE PÉRDIDAS Y GANANCIAS"]
[]
[null,"PERDIDAS Y GANANCIAS","AÑO 1","AÑO 2","AÑO 3","AÑO 4"]
[null,"MARGEN BRUTO",{"$f":"+O42","v":0},{"$f":"+P42","v":0},{"$f":"+Q42","v":0},{"$f":"+R42","v":0}]
[null,"EBITDA",{"$f":"+O45","v":0},{"$f":"+P45","v":0},{"$f":"+Q45","v":0},{"$f":"+R45","v":0}]
[null,"BAI",{"$f":"+O47","v":0},{"$f":"+P47","v":0},{"$f":"+Q47","v":0},{"$f":"+R47","v":0}]
[null,"BENEFICIO NETO (RESULTADO)",{"$f":"+O49","v":0},{"$f":"+P49","v":0},{"$f":"+Q49","v":0},{"$f":"+R49","v":0}]

{"sheet":"8.IMPUESTOS ","index":15,"n_rows":49,"n_cols":15,"rows_kept":49,"cut":false,"hidden":false,"merged":[]}
[]
[null,"Volver al Indice "]
[]
[]
[]
[]
[]
[]
[null,"LIQUIDACION IMPUESTOS"]
[]
[null,45540,null,null,null,0.25]
[]
[]
[null,"IVA"]
[]
[null,"IVA REPERCUTIDO",{"$f":"'7.CUENTA DE RESULTADOS '!C20","v":"1900enero"},{"$f":"'7.CUENTA DE RESULTADOS '!D20","v":"1900enero"},{"$f":"'7.CUENTA DE RESULTADOS '!E20","v":"1900febrero"},{"$f":"'7.CUENTA DE RESULTADOS '!F20","v":"1900marzo"},{"$f":"'7.CUENTA DE RESULTADOS '!G20","v":"1900abril"},{"$f":"'7.CUENTA DE RESULTADOS '!H20","v":"1900mayo"},{"$f":"'7.CUENTA DE RESULTADOS '!I20","v":"1900junio"},{"$f":"'7.CUENTA DE RESULTADOS '!J20","v":"1900julio"},{"$f":"'7.CUENTA DE RESULTADOS '!K20","v":"1900agosto"},{"$f":"'7.CUENTA DE RESULTADOS '!L20","v":"1900septiembre"},{"$f":"'7.CUENTA DE RESULTADOS '!M20","v":"1900octubre"},{"$f":"'7.CUENTA DE RESULTADOS '!N20","v":"1900noviembre"},"TOTAL"]
[null,"IVA GASTOS FIJOS",{"$f":"'5.GASTOS FIJOS'!C12","v":0},{"$f":"'5.GASTOS FIJOS'!D12","v":0},{"$f":"'5.GASTOS FIJOS'!E12","v":0},{"$f":"'5.GASTOS FIJOS'!F12","v":0},{"$f":"'5.GASTOS FIJOS'!G12","v":0},{"$f":"'5.GASTOS FIJOS'!H12","v":0},{"$f":"'5.GASTOS FIJOS'!I12","v":0},{"$f":"'5.GASTOS FIJOS'!J12","v":0},{"$f":"'5.GASTOS FIJOS'!K12","v":0},{"$f":"'5.GASTOS FIJOS'!L12","v":0},{"$f":"'5.GASTOS FIJOS'!M12","v":0},{"$f":"'5.GASTOS FIJOS'!N12","v":0},{"$f":"+SUM(C17:N17)","v":0}]
[null,"IVA GASTOS VARIABLES ",{"$f":"+'6.GASTOS VARIABLES'!D12+'6.GASTOS VARIABLES'!D13","v":0},{"$f":"+'6.GASTOS VARIABLES'!E12+'6.GASTOS VARIABLES'!E13","v":0},{"$f":"+'6.GASTOS VARIABLES'!F12+'6.GASTOS VARIABLES'!F13","v":0},{"$f":"+'6.GASTOS VARIABLES'!G12+'6.GASTOS VARIABLES'!G13","v":0},{"$f":"+'6.GASTOS VARIABLES'!H12+'6.GASTOS VARIABLES'!H13","v":0},{"$f":"+'6.GASTOS VARIABLES'!I12+'6.GASTOS VARIABLES'!I13","v":0},{"$f":"+'6.GASTOS VARIABLES'!J12+'6.GASTOS VARIABLES'!J13","v":0},{"$f":"+'6.GASTOS VARIABLES'!K12+'6.GASTOS VARIABLES'!K13","v":0},{"$f":"+'6.GASTOS VARIABLES'!L12+'6.GASTOS VARIABLES'!L13","v":0},{"$f":"+'6.GASTOS VARIABLES'!M12+'6.GASTOS VARIABLES'!M13","v":0},{"$f":"+'6.GASTOS VARIABLES'!N12+'6.GASTOS VARIABLES'!N13","v":0},{"$f":"+'6.GASTOS VARIABLES'!O12+'6.GASTOS VARIABLES'!O13","v":0},{"$f":"SUM(C18:N18)","v":0}]
[]
[null,"IVA DEVENGADO",{"$f":"'7.CUENTA DE RESULTADOS '!C20","v":"1900enero"},{"$f":"'7.CUENTA DE RESULTADOS '!D20","v":"1900enero"},{"$f":"'7.CUENTA DE RESULTADOS '!E20","v":"1900febrero"},{"$f":"'7.CUENTA DE RESULTADOS '!F20","v":"1900marzo"},{"$f":"'7.CUENTA DE RESULTADOS '!G20","v":"1900abril"},{"$f":"'7.CUENTA DE RESULTADOS '!H20","v":"1900mayo"},{"$f":"'7.CUENTA DE RESULTADOS '!I20","v":"1900junio"},{"$f":"'7.CUENTA DE RESULTADOS '!J20","v":"1900julio"},{"$f":"'7.CUENTA DE RESULTADOS '!K20","v":"1900agosto"},{"$f":"'7.CUENTA DE RESULTADOS '!L20","v":"1900septiembre"},{"$f":"'7.CUENTA DE RESULTADOS '!M20","v":"1900octubre"},{"$f":"'7.CUENTA DE RESULTADOS '!N20","v":"1900noviembre"},"TOTAL"]
[null,"IVA INGRESOS ",{"$f":"+'4.INGRESOS'!D15+'4.INGRESOS'!D16","v":0},{"$f":"+'4.INGRESOS'!E15+'4.INGRESOS'!E16","v":0},{"$f":"+'4.INGRESOS'!F15+'4.INGRESOS'!F16","v":0},{"$f":"+'4.INGRESOS'!G15+'4.INGRESOS'!G16","v":0},{"$f":"+'4.INGRESOS'!H15+'4.INGRESOS'!H16","v":0},{"$f":"+'4.INGRESOS'!I15+'4.INGRESOS'!I16","v":0},{"$f":"+'4.INGRESOS'!J15+'4.INGRESOS'!J16","v":0},{"$f":"+'4.INGRESOS'!K15+'4.INGRESOS'!K16","v":0},{"$f":"+'4.INGRESOS'!L15+'4.INGRESOS'!L16","v":0},{"$f":"+'4.INGRESOS'!M15+'4.INGRESOS'!M16","v":0},{"$f":"+'4.INGRESOS'!N15+'4.INGRESOS'!N16","v":0},{"$f":"+'4.INGRESOS'!O15+'4.INGRESOS'!O16","v":0},{"$f":"SUM(C21:N21)","v":0}]
[null,null,1,2,3,4,5,6,7,8,9,10,11,12]
[null,"LIQUIDACIÓN IVA",{"$f":"'7.CUENTA DE RESULTADOS '!C20","v":"1900enero"},{"$f":"'7.CUENTA DE RESULTADOS '!D20","v":"1900enero"},{"$f":"'7.CUENTA DE RESULTADOS '!E20","v":"1900febrero"},{"$f":"'7.CUENTA DE RESULTADOS '!F20","v":"1900marzo"},{"$f":"'7.CUENTA DE RESULTADOS '!G20","v":"1900abril"},{"$f":"'7.CUENTA DE RESULTADOS '!H20","v":"1900mayo"},{"$f":"'7.CUENTA DE RESULTADOS '!I20","v":"1900junio"},{"$f":"'7.CUENTA DE RESULTADOS '!J20","v":"1900julio"},{"$f":"'7.CUENTA DE RESULTADOS '!K20","v":"1900agosto"},{"$f":"'7.CUENTA DE RESULTADOS '!L20","v":"1900septiembre"},{"$f":"'7.CUENTA DE RESULTADOS '!M20","v":"1900octubre"},{"$f":"'7.CUENTA DE RESULTADOS '!N20","v":"1900noviembre"},"TOTAL"]
[null,"LIQUIDACIÓN IVA ",{"$f":"+C21-C$12-C18","v":0},0,0,0,0,0,0,0,0,0,0,0,{"$f":"+SUM(C24:N24)","v":0}]
[]
[]
[null,"RETENCIONES IRPF"]
[null,null,1,2,3,4,5,6,7,8,9,10,11,12]
[null," RETENCIONES IRPF",{"$f":"'7.CUENTA DE RESULTADOS '!C20","v":"1900enero"},{"$f":"'7.CUENTA DE RESULTADOS '!D20","v":"1900enero"},{"$f":"'7.CUENTA DE RESULTADOS '!E20","v":"1900febrero"},{"$f":"'7.CUENTA DE RESULTADOS '!F20","v":"1900marzo"},{"$f":"'7.CUENTA DE RESULTADOS '!G20","v":"1900abril"},{"$f":"'7.CUENTA DE RESULTADOS '!H20","v":"1900mayo"},{"$f":"'7.CUENTA DE RESULTADOS '!I20","v":"1900junio"},{"$f":"'7.CUENTA DE RESULTADOS '!J20","v":"1900julio"},{"$f":"'7.CUENTA DE RESULTADOS '!K20","v":"1900agosto"},{"$f":"'7.CUENTA DE RESULTADOS '!L20","v":"1900septiembre"},{"$f":"'7.CUENTA DE RESULTADOS '!M20","v":"1900octubre"},{"$f":"'7.CUENTA DE RESULTADOS '!N20","v":"1900noviembre"},"TOTAL"]
[null,"RETENCIONES IRPF ",{"$f":"VLOOKUP($B$30,'ANEXO GASTOS FIJOS'!$B$13:$O$41,3,1)","v":0},{"$f":"VLOOKUP($B$30,'ANEXO GASTOS FIJOS'!$B$13:$O$41,4,1)","v":0},{"$f":"VLOOKUP($B$30,'ANEXO GASTOS FIJOS'!$B$13:$O$41,5,1)","v":0},{"$f":"VLOOKUP($B$30,'ANEXO GASTOS FIJOS'!$B$13:$O$41,6,1)","v":0},{"$f":"VLOOKUP($B$30,'ANEXO GASTOS FIJOS'!$B$13:$O$41,7,1)","v":0},{"$f":"VLOOKUP($B$30,'ANEXO GASTOS FIJOS'!$B$13:$O$41,8,1)","v":0},{"$f":"VLOOKUP($B$30,'ANEXO GASTOS FIJOS'!$B$13:$O$41,9,1)","v":0},{"$f":"VLOOKUP($B$30,'ANEXO GASTOS FIJOS'!$B$13:$O$41,10,1)","v":0},{"$f":"VLOOKUP($B$30,'ANEXO GASTOS FIJOS'!$B$13:$O$41,11,1)","v":0},{"$f":"VLOOKUP($B$30,'ANEXO GASTOS FIJOS'!$B$13:$O$41,12,1)","v":0},{"$f":"VLOOKUP($B$30,'ANEXO GASTOS FIJOS'!$B$13:$O$41,13,1)","v":0},{"$f":"VLOOKUP($B$30,'ANEXO GASTOS FIJOS'!$B$13:$O$41,14,1)","v":0},{"$f":"SUM(C30:N30)","v":0}]
[]
[]
[null,"IMPUESTO BENEFICIOS (IRPF o IS)"]
[null,null,1,2,3,4,5,6,7,8,9,10,11,12]
[null,"IMPUESTO BENEFICIOS (IRPF o IS)",{"$f":"'7.CUENTA DE RESULTADOS '!C20","v":"1900enero"},{"$f":"'7.CUENTA DE RESULTADOS '!D20","v":"1900enero"},{"$f":"'7.CUENTA DE RESULTADOS '!E20","v":"1900febrero"},{"$f":"'7.CUENTA DE RESULTADOS '!F20","v":"1900marzo"},{"$f":"'7.CUENTA DE RESULTADOS '!G20","v":"1900abril"},{"$f":"'7.CUENTA DE RESULTADOS '!H20","v":"1900mayo"},{"$f":"'7.CUENTA DE RESULTADOS '!I20","v":"1900junio"},{"$f":"'7.CUENTA DE RESULTADOS '!J20","v":"1900julio"},{"$f":"'7.CUENTA DE RESULTADOS '!K20","v":"1900agosto"},{"$f":"'7.CUENTA DE RESULTADOS '!L20","v":"1900septiembre"},{"$f":"'7.CUENTA DE RESULTADOS '!M20","v":"1900octubre"},{"$f":"'7.CUENTA DE RESULTADOS '!N20","v":"1900noviembre"},"TOTAL"]
[null,"IMPUESTO BENEFICIOS (IRPF o IS)",{"$f":"'7.CUENTA DE RESULTADOS '!C48","v":{"$error":"#VALUE!"}},{"$f":"'7.CUENTA DE RESULTADOS '!D48","v":{"$error":"#VALUE!"}},{"$f":"'7.CUENTA DE RESULTADOS '!E48","v":{"$error":"#VALUE!"}},{"$f":"'7.CUENTA DE RESULTADOS '!F48","v":{"$error":"#VALUE!"}},{"$f":"'7.CUENTA DE RESULTADOS '!G48","v":{"$error":"#VALUE!"}},{"$f":"'7.CUENTA DE RESULTADOS '!H48","v":{"$error":"#VALUE!"}},{"$f":"'7.CUENTA DE RESULTADOS '!I48","v":{"$error":"#VALUE!"}},{"$f":"'7.CUENTA DE RESULTADOS '!J48","v":{"$error":"#VALUE!"}},{"$f":"'7.CUENTA DE RESULTADOS '!K48","v":{"$error":"#VALUE!"}},{"$f":"'7.CUENTA DE RESULTADOS '!L48","v":{"$error":"#VALUE!"}},{"$f":"'7.CUENTA DE RESULTADOS '!M48","v":{"$error":"#VALUE!"}},{"$f":"'7.CUENTA DE RESULTADOS '!N48","v":{"$error":"#VALUE!"}},{"$f":"+SUM(C36:N36)","v":{"$error":"#VALUE!"}}]
[]
[]
[null,"LIQUIDACIÓN TRIMESTRAL  IVA e IRPF e IMPUESTO SOBRE BENEFICIOS"]
[]
[null,null,1,2,3,4,5,6,7,8,9,10,11,12]
[null,"PAGOS IVA",{"$f":"'7.CUENTA DE RESULTADOS '!C20","v":"1900enero"},{"$f":"'7.CUENTA DE RESULTADOS '!D20","v":"1900enero"},{"$f":"'7.CUENTA DE RESULTADOS '!E20","v":"1900febrero"},{"$f":"'7.CUENTA DE RESULTADOS '!F20","v":"1900marzo"},{"$f":"'7.CUENTA DE RESULTADOS '!G20","v":"1900abril"},{"$f":"'7.CUENTA DE RESULTADOS '!H20","v":"1900mayo"},{"$f":"'7.CUENTA DE RESULTADOS '!I20","v":"1900junio"},{"$f":"'7.CUENTA DE RESULTADOS '!J20","v":"1900julio"},{"$f":"'7.CUENTA DE RESULTADOS '!K20","v":"1900agosto"},{"$f":"'7.CUENTA DE RESULTADOS '!L20","v":"1900septiembre"},{"$f":"'7.CUENTA DE RESULTADOS '!M20","v":"1900octubre"},{"$f":"'7.CUENTA DE RESULTADOS '!N20","v":"1900noviembre"},"TOTAL"]
[null,"LIQUIDACIÓN IVA ",{"$f":"+IF(RIGHT(C$42,5)=\"enero\",B24,IF(RIGHT(C$42,5)=\"abril\",B24,IF(RIGHT(C$42,5)=\"julio\",B24,IF(RIGHT(C$42,7)=\"octubre\",B24,0))))","v":"LIQUIDACIÓN IVA "},{"$f":"+IF(RIGHT(D$42,5)=\"enero\",C24,IF(RIGHT(D$42,5)=\"abril\",C24,IF(RIGHT(D$42,5)=\"julio\",C24,IF(RIGHT(D$42,7)=\"octubre\",C24,0))))","v":0},{"$f":"+IF(RIGHT(E$42,5)=\"enero\",C24+D24,IF(RIGHT(E$42,5)=\"abril\",C24+D24,IF(RIGHT(E$42,5)=\"julio\",C24+D24,IF(RIGHT(E$42,7)=\"octubre\",C24+D24,0))))","v":0},{"$f":"+IF(RIGHT(F$42,5)=\"enero\",C24+D24+E24,IF(RIGHT(F$42,5)=\"abril\",C24+D24+E24,IF(RIGHT(F$42,5)=\"julio\",C24+D24+E24,IF(RIGHT(F$42,7)=\"octubre\",C24+D24+E24,0))))","v":0},{"$f":"+IF(RIGHT(G$42,5)=\"enero\",D24+E24+F24,IF(RIGHT(G$42,5)=\"abril\",D24+E24+F24,IF(RIGHT(G$42,5)=\"julio\",D24+E24+F24,IF(RIGHT(G$42,7)=\"octubre\",D24+E24+F24,0))))","v":0},{"$f":"+IF(RIGHT(H$42,5)=\"enero\",E24+F24+G24,IF(RIGHT(H$42,5)=\"abril\",E24+F24+G24,IF(RIGHT(H$42,5)=\"julio\",E24+F24+G24,IF(RIGHT(H$42,7)=\"octubre\",E24+F24+G24,0))))","v":0},{"$f":"+IF(RIGHT(I$42,5)=\"enero\",F24+G24+H24,IF(RIGHT(I$42,5)=\"abril\",F24+G24+H24,IF(RIGHT(I$42,5)=\"julio\",F24+G24+H24,IF(RIGHT(I$42,7)=\"octubre\",F24+G24+H24,0))))","v":0},0,0,0,0,0,{"$f":"+SUM(C43:N43)","v":0}]
[null,null,1,2,3,4,5,6,7,8,9,10,11,12]
[null,"PAGOS RETENCIONES IRPF",{"$f":"'7.CUENTA DE RESULTADOS '!C20","v":"1900enero"},{"$f":"'7.CUENTA DE RESULTADOS '!D20","v":"1900enero"},{"$f":"'7.CUENTA DE RESULTADOS '!E20","v":"1900febrero"},{"$f":"'7.CUENTA DE RESULTADOS '!F20","v":"1900marzo"},{"$f":"'7.CUENTA DE RESULTADOS '!G20","v":"1900abril"},{"$f":"'7.CUENTA DE RESULTADOS '!H20","v":"1900mayo"},{"$f":"'7.CUENTA DE RESULTADOS '!I20","v":"1900junio"},{"$f":"'7.CUENTA DE RESULTADOS '!J20","v":"1900julio"},{"$f":"'7.CUENTA DE RESULTADOS '!K20","v":"1900agosto"},{"$f":"'7.CUENTA DE RESULTADOS '!L20","v":"1900septiembre"},{"$f":"'7.CUENTA DE RESULTADOS '!M20","v":"1900octubre"},{"$f":"'7.CUENTA DE RESULTADOS '!N20","v":"1900noviembre"},"TOTAL"]
[null,"LIQUIDACION RETENCIONES IRPF",{"$f":"+IF(RIGHT(C$42,5)=\"enero\",B27,IF(RIGHT(C$42,5)=\"abril\",B27,IF(RIGHT(C$42,5)=\"julio\",B27,IF(RIGHT(C$42,7)=\"octubre\",B27,0))))","v":"RETENCIONES IRPF"},{"$f":"+IF(RIGHT(D45,5)=\"enero\",C30,IF(RIGHT(D45,5)=\"abril\",C30,IF(RIGHT(D45,5)=\"julio\",C30,IF(RIGHT(D45,7)=\"octubre\",C30,0))))","v":0},{"$f":"+IF(RIGHT(E45,5)=\"enero\",C30+D30,IF(RIGHT(E45,5)=\"abril\",C30+D30,IF(RIGHT(E45,5)=\"julio\",C30+D30,IF(RIGHT(E45,7)=\"octubre\",C30+D30,0))))","v":0},{"$f":"+IF(RIGHT(F45,5)=\"enero\",C30+D30+E30,IF(RIGHT(F45,5)=\"abril\",C30+D30+E30,IF(RIGHT(F45,5)=\"julio\",C30+D30+E30,IF(RIGHT(F45,7)=\"octubre\",C30+D30+E30,0))))","v":0},{"$f":"+IF(RIGHT(G45,5)=\"enero\",D30+E30+F30,IF(RIGHT(G45,5)=\"abril\",D30+E30+F30,IF(RIGHT(G45,5)=\"julio\",D30+E30+F30,IF(RIGHT(G45,7)=\"octubre\",D30+E30+F30,0))))","v":0},0,0,0,0,0,0,0,{"$f":"+SUM(C46:N46)","v":0}]
[]
[null,"PAGO IMPUESTO BENEFICIOS (IRPF o IS)",{"$f":"'7.CUENTA DE RESULTADOS '!C20","v":"1900enero"},{"$f":"'7.CUENTA DE RESULTADOS '!D20","v":"1900enero"},{"$f":"'7.CUENTA DE RESULTADOS '!E20","v":"1900febrero"},{"$f":"'7.CUENTA DE RESULTADOS '!F20","v":"1900marzo"},{"$f":"'7.CUENTA DE RESULTADOS '!G20","v":"1900abril"},{"$f":"'7.CUENTA DE RESULTADOS '!H20","v":"1900mayo"},{"$f":"'7.CUENTA DE RESULTADOS '!I20","v":"1900junio"},{"$f":"'7.CUENTA DE RESULTADOS '!J20","v":"1900julio"},{"$f":"'7.CUENTA DE RESULTADOS '!K20","v":"1900agosto"},{"$f":"'7.CUENTA DE RESULTADOS '!L20","v":"1900septiembre"},{"$f":"'7.CUENTA DE RESULTADOS '!M20","v":"1900octubre"},{"$f":"'7.CUENTA DE RESULTADOS '!N20","v":"1900noviembre"},{"$f":"+O45","v":"TOTAL"}]
[null,"LIQUIDACION IMPUESTO BENEFICIOS (IRPF o IS)",{"$f":"+IF(RIGHT(C$42,5)=\"enero\",B30,IF(RIGHT(C$42,5)=\"abril\",B30,IF(RIGHT(C$42,5)=\"julio\",B30,IF(RIGHT(C$42,7)=\"octubre\",B30,0))))","v":"RETENCIONES IRPF "},{"$f":"+IF(RIGHT(D$42,5)=\"enero\",C36,IF(RIGHT(D$42,5)=\"abril\",C36,IF(RIGHT(D$42,5)=\"julio\",C36,IF(RIGHT(D$42,7)=\"octubre\",C36,0))))","v":{"$error":"#VALUE!"}},{"$f":"+IF(RIGHT(E$42,5)=\"enero\",C36+D36,IF(RIGHT(E$42,5)=\"abril\",C36+D36,IF(RIGHT(E$42,5)=\"julio\",C36+D36,IF(RIGHT(E$42,7)=\"octubre\",C36+D36,0))))","v":0},{"$f":"+IF(RIGHT(F$42,5)=\"enero\",C36+D36+E36,IF(RIGHT(F$42,5)=\"abril\",C36+D36+E36,IF(RIGHT(F$42,5)=\"julio\",C36+D36+E36,IF(RIGHT(F$42,7)=\"octubre\",C36+D36+E36,0))))","v":0},{"$f":"+IF(RIGHT(G$42,5)=\"enero\",D36+E36+F36,IF(RIGHT(G$42,5)=\"abril\",D36+E36+F36,IF(RIGHT(G$42,5)=\"julio\",D36+E36+F36,IF(RIGHT(G$42,7)=\"octubre\",D36+E36+F36,0))))","v":{"$error":"#VALUE!"}},0,0,{"$error":"#VALUE!"},0,0,{"$error":"#VALUE!"},0,{"$f":"+SUM(C49:N49)","v":{"$error":"#VALUE!"}}]

{"sheet":"9.PLAN TESORERIA","index":16,"n_rows":41,"n_cols":14,"rows_kept":41,"cut":false,"hidden":false,"merged":[]}
[]
[null,"Volver al Indice "]
[null,"Consultar anexo gastos variables  "]
[]
[]
[]
[]
[null,"FLUJO DE TESORERÍA"]
[]
[]
[null,45540,null,null,null,0.25]
[]
[]
[]
[]
[]
[]
[]
[]
[]
[]
[]
[]
[]
[]
[]
[]
[null,null,1,2,3,4,5,6,7,8,9,10,11,12]
[null,"Flujo Tesoreria",{"$f":"'7.CUENTA DE RESULTADOS '!C20","v":"1900enero"},{"$f":"'7.CUENTA DE RESULTADOS '!D20","v":"1900enero"},{"$f":"'7.CUENTA DE RESULTADOS '!E20","v":"1900febrero"},{"$f":"'7.CUENTA DE RESULTADOS '!F20","v":"1900marzo"},{"$f":"'7.CUENTA DE RESULTADOS '!G20","v":"1900abril"},{"$f":"'7.CUENTA DE RESULTADOS '!H20","v":"1900mayo"},{"$f":"'7.CUENTA DE RESULTADOS '!I20","v":"1900junio"},{"$f":"'7.CUENTA DE RESULTADOS '!J20","v":"1900julio"},{"$f":"'7.CUENTA DE RESULTADOS '!K20","v":"1900agosto"},{"$f":"'7.CUENTA DE RESULTADOS '!L20","v":"1900septiembre"},{"$f":"'7.CUENTA DE RESULTADOS '!M20","v":"1900octubre"},{"$f":"'7.CUENTA DE RESULTADOS '!N20","v":"1900noviembre"}]
[]
[null,"Tesorería inicial",{"$f":"+'3.INVERSION_FINANCIACION'!C53","v":0},{"$f":"+C41","v":{"$error":"#VALUE!"}},{"$f":"+D41","v":{"$error":"#VALUE!"}},{"$error":"#VALUE!"},{"$error":"#VALUE!"},{"$error":"#VALUE!"},{"$error":"#VALUE!"},{"$error":"#VALUE!"},{"$error":"#VALUE!"},{"$error":"#VALUE!"},{"$error":"#VALUE!"},{"$error":"#VALUE!"}]
[null,"Cobros Ordinarios",{"$f":"'ANEXO TESORERIA'!E43","v":0},{"$f":"'ANEXO TESORERIA'!F43","v":0},{"$f":"'ANEXO TESORERIA'!G43","v":0},{"$f":"'ANEXO TESORERIA'!H43","v":0},{"$f":"'ANEXO TESORERIA'!I43","v":0},{"$f":"'ANEXO TESORERIA'!J43","v":0},{"$f":"'ANEXO TESORERIA'!K43","v":0},{"$f":"'ANEXO TESORERIA'!L43","v":0},{"$f":"'ANEXO TESORERIA'!M43","v":0},{"$f":"'ANEXO TESORERIA'!N43","v":0},{"$f":"'ANEXO TESORERIA'!O43","v":0},{"$f":"'ANEXO TESORERIA'!P43","v":0}]
[null,"Cobros Extraordinarios",{"$f":"+'ANEXO TESORERIA'!E56","v":0},{"$f":"+'ANEXO TESORERIA'!F56","v":0},{"$f":"+'ANEXO TESORERIA'!G56","v":0},{"$f":"+'ANEXO TESORERIA'!H56","v":0},{"$f":"+'ANEXO TESORERIA'!I56","v":0},{"$f":"+'ANEXO TESORERIA'!J56","v":0},{"$f":"+'ANEXO TESORERIA'!K56","v":0},{"$f":"+'ANEXO TESORERIA'!L56","v":0},{"$f":"+'ANEXO TESORERIA'!M56","v":0},{"$f":"+'ANEXO TESORERIA'!N56","v":0},{"$f":"+'ANEXO TESORERIA'!O56","v":0},{"$f":"+'ANEXO TESORERIA'!P56","v":0}]
[null,"Total Cobros",{"$f":"SUM(C32:C33)","v":0},0,0,0,0,0,0,0,0,0,0,0]
[null,"Pagos Fijos",{"$f":"+'ANEXO TESORERIA'!E88","v":0},{"$f":"+'ANEXO TESORERIA'!F88","v":0},{"$f":"+'ANEXO TESORERIA'!G88","v":0},{"$f":"+'ANEXO TESORERIA'!H88","v":0},{"$f":"+'ANEXO TESORERIA'!I88","v":0},{"$f":"+'ANEXO TESORERIA'!J88","v":0},{"$f":"+'ANEXO TESORERIA'!K88","v":0},{"$f":"+'ANEXO TESORERIA'!L88","v":0},{"$f":"+'ANEXO TESORERIA'!M88","v":0},{"$f":"+'ANEXO TESORERIA'!N88","v":0},{"$f":"+'ANEXO TESORERIA'!O88","v":0},{"$f":"+'ANEXO TESORERIA'!P88","v":0}]
[null,"Pagos Variables ",{"$f":"+'6.GASTOS VARIABLES'!D52+'6.GASTOS VARIABLES'!D146","v":0},{"$f":"+'6.GASTOS VARIABLES'!E52+'6.GASTOS VARIABLES'!E146","v":0},{"$f":"+'6.GASTOS VARIABLES'!F52+'6.GASTOS VARIABLES'!F146","v":0},{"$f":"+'6.GASTOS VARIABLES'!G52+'6.GASTOS VARIABLES'!G146","v":0},{"$f":"+'6.GASTOS VARIABLES'!H52+'6.GASTOS VARIABLES'!H146","v":0},{"$f":"+'6.GASTOS VARIABLES'!I52+'6.GASTOS VARIABLES'!I146","v":0},{"$f":"+'6.GASTOS VARIABLES'!J52+'6.GASTOS VARIABLES'!J146","v":0},{"$f":"+'6.GASTOS VARIABLES'!K52+'6.GASTOS VARIABLES'!K146","v":0},{"$f":"+'6.GASTOS VARIABLES'!L52+'6.GASTOS VARIABLES'!L146","v":0},{"$f":"+'6.GASTOS VARIABLES'!M52+'6.GASTOS VARIABLES'!M146","v":0},{"$f":"+'6.GASTOS VARIABLES'!N52+'6.GASTOS VARIABLES'!N146","v":0},{"$f":"+'6.GASTOS VARIABLES'!O52+'6.GASTOS VARIABLES'!O146","v":0}]
[null,"Pago Impuestos ",{"$f":"+'ANEXO TESORERIA'!E162+'ANEXO TESORERIA'!E165+'ANEXO TESORERIA'!E168","v":{"$error":"#VALUE!"}},{"$f":"+'ANEXO TESORERIA'!F162+'ANEXO TESORERIA'!F165+'ANEXO TESORERIA'!F168","v":{"$error":"#VALUE!"}},{"$f":"+'ANEXO TESORERIA'!G162+'ANEXO TESORERIA'!G165+'ANEXO TESORERIA'!G168","v":0},{"$f":"+'ANEXO TESORERIA'!H162+'ANEXO TESORERIA'!H165+'ANEXO TESORERIA'!H168","v":0},{"$f":"+'ANEXO TESORERIA'!I162+'ANEXO TESORERIA'!I165+'ANEXO TESORERIA'!I168","v":{"$error":"#VALUE!"}},{"$f":"+'ANEXO TESORERIA'!J162+'ANEXO TESORERIA'!J165+'ANEXO TESORERIA'!J168","v":0},{"$f":"+'ANEXO TESORERIA'!K162+'ANEXO TESORERIA'!K165+'ANEXO TESORERIA'!K168","v":0},{"$f":"+'ANEXO TESORERIA'!L162+'ANEXO TESORERIA'!L165+'ANEXO TESORERIA'!L168","v":{"$error":"#VALUE!"}},{"$f":"+'ANEXO TESORERIA'!M162+'ANEXO TESORERIA'!M165+'ANEXO TESORERIA'!M168","v":0},{"$f":"+'ANEXO TESORERIA'!N162+'ANEXO TESORERIA'!N165+'ANEXO TESORERIA'!N168","v":0},{"$f":"+'ANEXO TESORERIA'!O162+'ANEXO TESORERIA'!O165+'ANEXO TESORERIA'!O168","v":{"$error":"#VALUE!"}},{"$f":"+'ANEXO TESORERIA'!P162+'ANEXO TESORERIA'!P165+'ANEXO TESORERIA'!P168","v":0}]
[null,"Pago Préstamo",{"$f":"+'ANEXO TESORERIA'!E155","v":""},{"$f":"+'ANEXO TESORERIA'!F155","v":""},{"$f":"+'ANEXO TESORERIA'!G155","v":""},{"$f":"+'ANEXO TESORERIA'!H155","v":""},{"$f":"+'ANEXO TESORERIA'!I155","v":""},{"$f":"+'ANEXO TESORERIA'!J155","v":""},{"$f":"+'ANEXO TESORERIA'!K155","v":""},{"$f":"+'ANEXO TESORERIA'!L155","v":""},{"$f":"+'ANEXO TESORERIA'!M155","v":""},{"$f":"+'ANEXO TESORERIA'!N155","v":""},{"$f":"+'ANEXO TESORERIA'!O155","v":""},{"$f":"+'ANEXO TESORERIA'!P155","v":""}]
[null,"Total Pagos",{"$f":"+SUM(C35:C38)","v":{"$error":"#VALUE!"}},{"$f":"+SUM(D35:D38)","v":{"$error":"#VALUE!"}},0,0,{"$error":"#VALUE!"},0,0,{"$error":"#VALUE!"},0,0,{"$error":"#VALUE!"},0]
[]
[null,"Saldo Tesorería",{"$f":"C31+C34-C39","v":{"$error":"#VALUE!"}},{"$error":"#VALUE!"},{"$error":"#VALUE!"},{"$error":"#VALUE!"},{"$error":"#VALUE!"},{"$error":"#VALUE!"},{"$error":"#VALUE!"},{"$error":"#VALUE!"},{"$error":"#VALUE!"},{"$error":"#VALUE!"},{"$error":"#VALUE!"},{"$error":"#VALUE!"}]

{"sheet":"10. BALANCE","index":17,"n_rows":95,"n_cols":8,"rows_kept":95,"cut":false,"hidden":false,"merged":[[42,1,48,6],[91,6,91,7],[92,6,92,7],[93,6,93,7],[94,6,94,7],[65,7,65,11]]}
[]
[null,"Volver al Indice "]
[]
[]
[]
[]
[null,"BALANCE DE SITUACIÓN"]
[]
[null,"ACTIVO","INICIAL","AÑO 1","AÑO 2","AÑO 3","AÑO 4 "]
[]
[null,"ACTIVO NO CORRIENTE",{"$f":"+SUM(C12:C14)","v":0},{"$f":"+SUM(D12:D14)","v":0},{"$f":"+SUM(E12:E14)","v":0},0.25,{"$f":"+SUM(G12:G14)","v":0}]
[null,"Inmovilizado Material (tangible)",{"$f":"SUMIF('ANEXO INVERSIÓN'!B22:B38,\"Inmovilizado Material (tangible)\",'ANEXO INVERSIÓN'!E22:E38)","v":0},{"$f":"C12+SUMIF('ANEXO INVERSIÓN'!B22:B38,\"Inmovilizado Material (tangible)\",'ANEXO INVERSIÓN'!J22:J38)","v":0},{"$f":"D12+SUMIF('ANEXO INVERSIÓN'!C22:C38,\"Inmovilizado Material (tangible)\",'ANEXO INVERSIÓN'!K22:K38)","v":0},{"$f":"E12+SUMIF('ANEXO INVERSIÓN'!D22:D38,\"Inmovilizado Material (tangible)\",'ANEXO INVERSIÓN'!L22:L38)","v":0},{"$f":"F12+SUMIF('ANEXO INVERSIÓN'!E22:E38,\"Inmovilizado Material (tangible)\",'ANEXO INVERSIÓN'!M22:M38)","v":0}]
[null,"Inmovilizado Inmaterial (intangible)",{"$f":"SUMIF('ANEXO INVERSIÓN'!B22:B38,\"Inmovilizado Inmaterial (intangible)\",'ANEXO INVERSIÓN'!E22:E38)","v":0},{"$f":"C12+SUMIF('ANEXO INVERSIÓN'!B22:B38,\"Inmovilizado Inmaterial (Intangible)\",'ANEXO INVERSIÓN'!J22:J38)","v":0},{"$f":"D12+SUMIF('ANEXO INVERSIÓN'!C22:C38,\"Inmovilizado Inmaterial (Intangible)\",'ANEXO INVERSIÓN'!K22:K38)","v":0},{"$f":"E12+SUMIF('ANEXO INVERSIÓN'!D22:D38,\"Inmovilizado Inmaterial (Intangible)\",'ANEXO INVERSIÓN'!L22:L38)","v":0},{"$f":"F12+SUMIF('ANEXO INVERSIÓN'!E22:E38,\"Inmovilizado Inmaterial (Intangible)\",'ANEXO INVERSIÓN'!M22:M38)","v":0}]
[null,"Inmovilizado Financiero",0,0,0,0,0]
[null,"ACTIVO CORRIENTE",{"$f":"+SUM(C16:C18)","v":0},{"$f":"+SUM(D16:D18)","v":0},{"$f":"+SUM(E16:E18)","v":0},{"$f":"+SUM(F16:F18)","v":0},{"$f":"F15","v":0}]
[null,"Existencias",{"$f":"SUMIF('ANEXO INVERSIÓN'!B40:B45,\"Existencias\",'ANEXO INVERSIÓN'!E40:E45)","v":0},{"$f":"C16","v":0},{"$f":"D16","v":0},{"$f":"E16","v":0},{"$f":"F16","v":0}]
[null,"Deudores",0,0,0,0,0]
[null,"Efectivo",{"$f":"SUMIF('ANEXO INVERSIÓN'!B40:B45,\"Efectivo\",'ANEXO INVERSIÓN'!E40:E45)","v":0},{"$f":"C18","v":0},{"$f":"D18","v":0},{"$f":"E18","v":0},{"$f":"F18","v":0}]
[]
[null,"TOTAL ACTIVO",{"$f":"+C11+C15","v":0},{"$f":"+D11+D15","v":0},{"$f":"+E11+E15","v":0},{"$f":"+F11+F15","v":0.25},{"$f":"+G11+G15","v":0}]
[]
[null,"PASIVO","INICIAL","AÑO 1","AÑO 2","AÑO 3","AÑO 4"]
[]
[null,"PATRIMONIO NETO",{"$f":"+SUM(C25:C28)","v":0},{"$f":"+SUM(D25:D28)","v":0},{"$f":"+SUM(E25:E28)","v":0},{"$f":"+SUM(F25:F28)","v":0.25},{"$f":"+SUM(G25:G28)","v":0}]
[null,"Fondos Propios",{"$f":"'ANEXO FINANCIACIÓN'!C11","v":0},{"$f":"+C25","v":0},{"$f":"+D25","v":0},{"$f":"+E25","v":0},{"$f":"F25","v":0}]
[null,"Variación fondos propios para cubrir  inversiones años siguientes",{"$f":"-C25-C27-C28-C29-C33+C20","v":0},{"$f":"-D25-D27-D28-D29-D33+D20","v":0},{"$f":"-E25-E27-E28-E29-E33+E20","v":0},{"$f":"-F25-F27-F28-F29-F33+F20","v":0.25},{"$f":"-G25-G27-G28-G29-G33+G20","v":0}]
[null,"Resultado del ejercicio",null,{"$f":"'7.CUENTA DE RESULTADOS '!C68","v":0},{"$f":"'7.CUENTA DE RESULTADOS '!D68","v":0},{"$f":"'7.CUENTA DE RESULTADOS '!E68","v":0},{"$f":"'7.CUENTA DE RESULTADOS '!F68","v":0}]
[null,"Resultados de ejercicios anteriores",null,null,{"$f":"+D27","v":0},{"$f":"+E27","v":0},{"$f":"F27","v":0}]
[null,"PASIVO NO CORRIENTE",{"$f":"+SUM(C30:C31)","v":0},{"$f":"+SUM(D30:D31)","v":0},{"$f":"+SUM(E30:E31)","v":0},{"$f":"+SUM(F30:F31)","v":0},{"$f":"+SUM(G30:G31)","v":0}]
[null,"Deudas con entidades de crédito a largo plazo",{"$f":"'ANEXO FINANCIACIÓN'!C17","v":0},{"$f":"C30-'ANEXO FINANCIACIÓN'!G16-'ANEXO FINANCIACIÓN'!G17","v":0},{"$f":"D30-'ANEXO FINANCIACIÓN'!H16-'ANEXO FINANCIACIÓN'!H17","v":0},{"$f":"E30-'ANEXO FINANCIACIÓN'!I16-'ANEXO FINANCIACIÓN'!I17","v":0},{"$f":"F30-'ANEXO FINANCIACIÓN'!J16-'ANEXO FINANCIACIÓN'!J17","v":0}]
[null,"Otras deudas a largo plazo",{"$f":"'ANEXO FINANCIACIÓN'!C18","v":0},{"$f":"+C31","v":0},{"$f":"+C31","v":0},{"$f":"+C31","v":0},{"$f":"+D31","v":0}]
[null,"Otro a largo plazo ",{"$f":"'ANEXO FINANCIACIÓN'!C19","v":0},{"$f":"+C32","v":0},{"$f":"+C32","v":0},{"$f":"+C32","v":0},{"$f":"+D32","v":0}]
[null,"PASIVO CORRIENTE",{"$f":"+SUM(C34:C37)","v":0},{"$f":"+SUM(D34:D37)","v":0},{"$f":"+SUM(E34:E37)","v":0},{"$f":"+SUM(F34:F37)","v":0},{"$f":"+SUM(G34:G37)","v":0}]
[null,"Proveedores",{"$f":"'ANEXO FINANCIACIÓN'!C21","v":0},{"$f":"+C34","v":0},{"$f":"+C34","v":0},{"$f":"+C34","v":0},{"$f":"+D34","v":0}]
[null,"Deudas con entidades de crédito a corto plazo",{"$f":"'ANEXO FINANCIACIÓN'!C22","v":0},0,0,0,0]
[null,"Deudas con las Administraciones Públicas",{"$f":"'ANEXO FINANCIACIÓN'!C23","v":0},0,{"$f":"+C36","v":0},{"$f":"+C36","v":0},{"$f":"+D36","v":0}]
[null,"Otras deudas a corto plazo",{"$f":"'ANEXO FINANCIACIÓN'!C24","v":0},0,{"$f":"+C37","v":0},{"$f":"+C37","v":0},{"$f":"+D37","v":0}]
[null,"Otro a corto plazo ",{"$f":"'ANEXO FINANCIACIÓN'!C25","v":0},0,0,0,0]
[null,"TOTAL PASIVO",{"$f":"+C24+C29+C33","v":0},{"$f":"+D24+D29+D33","v":0},{"$f":"+E24+E29+E33","v":0},{"$f":"+F24+F29+F33","v":0.25},{"$f":"+G24+G29+G33","v":0}]
[]
[null,"Descuadre entre activo y pasivo ",{"$f":"+C39-C20","v":0},{"$f":"+D20-D39","v":0},{"$f":"+E20-E39","v":0},{"$f":"+F20-F39","v":0},{"$f":"+G20-G39","v":0}]
[]
[]
[]
[]
[]
[]
[]
[]
[]
[]
[]
[]
[]
[]
[]
[]
[]
[]
[]
[]
[]
[]
[null,"RATIOS ECONÓMICOS Y FINANCIEROS"]
[]
[null,"RATIOS FINANCIEROS","Inicial","AÑO 1","AÑO 2","AÑO 3","AÑO 4 ","COMENTARIOS A LA EVOLUCIÓN"]
[null,"GARANTIA",{"$f":"+IFERROR(C20/(C29+C33),0)","v":0},{"$f":"+IFERROR(C20/(C29+C33),0)","v":0},{"$f":"+IFERROR(D20/(D29+D33),0)","v":0},{"$f":"+IFERROR(E20/(E29+E33),0)","v":0},{"$f":"+IFERROR(F20/(F29+F33),0)","v":0},"Crecimiento del ratio de garantía para los cuatro años previstos."]
[null,"LIQUIDEZ",{"$f":"+IFERROR(C15/C33,0)","v":0},{"$f":"+IFERROR(C15/C33,0)","v":0},{"$f":"+IFERROR(D15/D33,0)","v":0},{"$f":"+IFERROR(E15/E33,0)","v":0},{"$f":"+IFERROR(F15/F33,0)","v":0},"Crecimiento del ratio de liquidez para los cuatro años previstos."]
[null,"TESORERÍA",{"$f":"+IFERROR(C18/C33,0)","v":0},{"$f":"+IFERROR(C18/C33,0)","v":0},{"$f":"+IFERROR(D18/D33,0)","v":0},{"$f":"+IFERROR(E18/E33,0)","v":0},{"$f":"+IFERROR(F18/F33,0)","v":0},"Crecimiento del ratio de tesorería para los cuatro años previstos."]
[null,"ENDEUDAMIENTO",{"$f":"+IFERROR((C29+C33)/C39,0)","v":0},{"$f":"+IFERROR((C29+C33)/C39,0)","v":0},{"$f":"+IFERROR((D29+D33)/D39,0)","v":0},{"$f":"+IFERROR((E29+E33)/E39,0)","v":0},{"$f":"+IFERROR((F29+F33)/F39,0)","v":0},"Disminución del ratio de endeudamiento para los cuatro años previstos."]
[null,"AUTONOMÍA FINANCIERA ",{"$f":"+IFERROR(C24/(C29+C33),0)","v":0},{"$f":"+IFERROR(C24/(C29+C33),0)","v":0},{"$f":"+IFERROR(D24/(D29+D33),0)","v":0},{"$f":"+IFERROR(E24/(E29+E33),0)","v":0},{"$f":"+IFERROR(F24/(F29+F33),0)","v":0},"Incremento de la autonomia financiera para los cuatro años previstos."]
[null,"FONDO DE MANIOBRA",{"$f":"+C15-C33","v":0},{"$f":"+D15-D33","v":0},{"$f":"+E15-E33","v":0},{"$f":"+F15-F33","v":0},{"$f":"+G15-G33","v":0},"Aumento del fondo de maniobra en los cuatro años previstos."]
[]
[]
[]
[]
[]
[]
[]
[]
[]
[]
[]
[]
[]
[]
[]
[]
[]
[]
[]
[null,"RATIOS ECONÓMICOS","AÑO 1","AÑO 2","AÑO 3","AÑO 4 ","COMENTARIOS A LA EVOLUCIÓN"]
[null,"RENTABILIDAD ECONÓMICA",{"$f":"IFERROR('7.CUENTA DE RESULTADOS '!O45/'10. BALANCE'!D20,0)","v":0},{"$f":"IFERROR('7.CUENTA DE RESULTADOS '!P45/'10. BALANCE'!E20,0)","v":0},{"$f":"IFERROR('7.CUENTA DE RESULTADOS '!Q45/'10. BALANCE'!F20,0)","v":0},{"$f":"IFERROR('7.CUENTA DE RESULTADOS '!R45/'10. BALANCE'!G20,0)","v":0},"Crecimiento durante los cuatro años."]
[null,"RENTABILIDAD FINANCIERA",{"$f":"IFERROR('7.CUENTA DE RESULTADOS '!O45/P32,0)","v":0},{"$f":"IFERROR('7.CUENTA DE RESULTADOS '!P45/Q32,0)","v":0},{"$f":"IFERROR('7.CUENTA DE RESULTADOS '!Q45/R32,0)","v":0},{"$f":"IFERROR('7.CUENTA DE RESULTADOS '!R45/S32,0)","v":0},"Crecimiento durante los cuatro años."]
[null,"PUNTO DE EQUILIBRIO",{"$f":"+IFERROR('7.CUENTA DE RESULTADOS '!O44/(1-('7.CUENTA DE RESULTADOS '!O41/'7.CUENTA DE RESULTADOS '!O40)),0)","v":0},{"$f":"+IFERROR('7.CUENTA DE RESULTADOS '!P44/(1-('7.CUENTA DE RESULTADOS '!P41/'7.CUENTA DE RESULTADOS '!P40)),0)","v":0},{"$f":"+IFERROR('7.CUENTA DE RESULTADOS '!Q44/(1-('7.CUENTA DE RESULTADOS '!Q41/'7.CUENTA DE RESULTADOS '!Q40)),0)","v":0},{"$f":"+IFERROR('7.CUENTA DE RESULTADOS '!R44/(1-('7.CUENTA DE RESULTADOS '!R41/'7.CUENTA DE RESULTADOS '!R40)),0)","v":0},"Crecimiento durante los cuatro años."]

{"sheet":"TABLAS REFERENCIA ","index":18,"n_rows":112,"n_cols":28,"rows_kept":112,"cut":false,"hidden":false,"merged":[[5,2,5,6],[23,2,25,5],[13,19,17,20],[9,15,12,16],[2,10,2,12],[18,19,20,20],[111,7,114,8],[44,7,45,8],[40,10,41,12],[42,10,45,12]]}
["Volver al indice "]
[]
["Tablas de referencia ",null,null,null,null,null,null,null,null,null,"Volver a calculadora"]
[]
["a.Tabla de tipos de empresa ",null,"b. Tabla de coeficientes de amortización contable lineal",null,null,null,null,"c. Tablas de IVA productos o servicios   ",null,null,"d. Tabla de productividad y ciclos anuales por producto ",null,null,null,null,"e. Tabla de coste de inversion por m²",null,null,null,"f. Tabla de coste fijo por m²",null,null,null,"g. Tipologías de activos corrientes y no corrientes ",null,null,null,"h. Productos cultivados  "]
[]
["TIPO DE EMPRESA ",null,"TIPOS DE ACTIVOS NO CORRIENTES ","AMORTIZACION ANUAL","IVA aplicable ","Amortizacion en años",null,"TIPOS DE PRODUCTOS O SERVICIOS ","IVA % ",null,"Cultivo","Productividad por ciclo (kg/m2)","Ciclos anuales ",null,null,"TIPOS DE INVERSION POR SUPERFICIE  ","Inversion por m²",null,null,"TIPO DE GASTO FIJO POR SUPERFICIE","Coste por m²",null,null,"Activos no corrientes ",null,null,null,"¿Este producto además de venderlo también lo cultivamos? Indicar SI o No"]
["Autónomo ",null,"Terrenos y bienes naturales",0.03,0.21,{"$f":"100%/D8","v":33.333333333333336},null,"Acelga",0,null,"Acelga",2.1,2,null,null,"Instalación de riego ",0.63,null,null,"Consumo de agua ",1.26,null,null,"Inmovilizado Material (tangible)",null,null,null,"SI "]
["Sociedad ",null,"Construcciones",0.1,0.21,{"$f":"100%/D9","v":10},null,"Ajo tierno",0,null,"Ajo tierno",1.4,1,null,null,null,null,null,null,"Mantenimiento de riego ",0.12,null,null,"Inmovilizado Inmaterial (intangible)",null,null,null,"NO "]
["Cooperativa",null,"Maquinaria",0.13,0.21,7.6923076923076916,null,"Alcachofa",0,null,"Alcachofa",1.3,1,null,null,"Fuente: media del gasto real de 5 proyectos productivos agroecológicos de la zona centro peninsular de 2 ha de media. ",null,null,null,"Plantel",0.15]
["Otros",null,"Utillaje y herramienta",0.2,0.21,5,null,"Alimentos frescos (frutas, verduras, leche,...) y harinas.",0,null,"Apio verde",2.1,2,null,null,null,null,null,null,"Fitosanitarios ",0.08]
[null,null,"Otras instalaciones",0.1,0.21,10,null,"Apio verde",0,null,"Aromaticas",0.04,1,null,null,null,null,null,null,"Fertilizantes ",0.05,null,null,"Activos corrientes "]
[null,null,"Mobiliario",0.1,0.03,10,null,"Aromaticas",0.1,null,"Berenjena",3.1,1,null,null,null,null,null,null,null,null,null,null,"Existencias"]
[null,null,"Equipos para proceso de información",0.25,0.21,4,null,"Berenjena",0,null,"Berza",2.1,1,null,null,null,null,null,null,"Fuente de los valores de referencia de Mantenimiento de riego; Plantel; Fitosanitarios y Fertilizantes: media del gasto real de 5 proyectos productivos agroecológicos de la zona centro peninsular de 2 ha de media. ",null,null,null,"Efectivo"]
[null,null,"Elementos de transporte",0.15,0.21,6.666666666666667,null,"Berza",0,null,"Borraja",1.5,2]
[null,null,"Gastos de inv.y des., pro. intelectual y derechos de traspaso",0.2,0.03,5,null,"Borraja",0,null,"Brócoli",0.8,1]
[null,null,"Instalacion riego ",0.33,0.04,3.0303030303030303,null,"Brócoli",0,null,"Calabacín",3.1,1]
[null,null,"Aplicaciones informáticas",0.1,0.21,10,null,"Calabacín",0,null,"Calabaza",2.2999999999999998,1]
[null,null,null,null,null,null,null,"Calabaza",0,null,"Cardo",1.2,1,null,null,null,null,null,null,"Fuente: Consumo de agua. Datos calculados para un consumo de 7.000 m3 por hectárea al año. Media de gasto real de agua,  de varias parcelas en la Comunidad de Madrid."]
[null,null,"Fuente: Estimación de ESF 2023 ",null,null,null,null,"Cardo",0,null,"Cebolla tierna",1.6,2]
[null,null,null,null,null,null,null,"Cebolla tierna",0,null,"Cebolleta",2.1,1]
[null,null,"Para consultar mas amortizaciones dirigirse a estas fuentes",null,null,null,null,"Cebolleta",0,null,"Col de Bruselas",2.9,1]
[null,null," https://www.iberley.es/temas/tablas-amortizacion-i-sociedades-30681",null,null,null,null,"Cestas ",0,null,"Coliflor",1.9,1]
[null,null,"https://sede.agenciatributaria.gob.es/Sede/ayuda/manuales-videos-folletos/manuales-practicos/irpf-2022/c09-rendimientos-actividades-economicas-eo-fores/determinacion-rendimiento-neto/fase-2-determinacion-rendimiento-neto-minorado/amortizacion-inmovilizado-material-inmaterial/tabla-amortizacion.html",null,null,null,null,"Col de Bruselas",0,null,"Escarola",1.2,1]
[null,null,null,null,null,null,null,"Coliflor",0,null,"Espárrago verde",0.55000000000000004,1]
[null,null,null,null,null,null,null,"Escarola",0,null,"Espinaca",1.9,2]
[null,null,null,null,null,null,null,"Espárrago verde",0,null,"Flores ",10,1]
[null,null,null,null,null,null,null,"Espinaca",0,null,"Fresa y fresón",1.5,1]
[null,null,null,null,null,null,null,"Flores",0.1,null,"Haba verde",0.9,1]
[null,null,null,null,null,null,null,"Fresa y fresón",0,null,"Judía verde ",1.3,1]
[null,null,null,null,null,null,null,"Haba verde",0,null,"Lechuga",2.4,2]
[null,null,null,null,null,null,null,"Judía verde ",0,null,"Melón piel de sapo",2.6,1]
[null,null,null,null,null,null,null,"Lechuga",0,null,"Perejil",1.6,2]
[null,null,null,null,null,null,null,"Melón piel de sapo",0,null,"Pimiento verde",2.7,1]
[null,null,null,null,null,null,null,"Perejil",0,null,"Puerro",2.8,1]
[null,null,null,null,null,null,null,"Pimiento verde",0,null,"Rábano",1.7,4]
[null,null,null,null,null,null,null,"Puerro",0,null,"Sandía",3.7,1]
[null,null,null,null,null,null,null,"Rábano",0,null,"Tomate",5.2,1]
[null,null,null,null,null,null,null,"Sandía",0,null,"Zanahoria",3.2,2]
[null,null,null,null,null,null,null,"Talleres, formaciones no incluidos en planes de estudios",0.21]
[null,null,null,null,null,null,null,"Tomate",0,null,"Fuente de Flores y Aromáticas:  Anuario estadístico del Ministerio de Agricultura 2021"]
[null,null,null,null,null,null,null,"Zanahoria",0]
[null,null,null,null,null,null,null,null,null,null,"Fuente resto de productos : Productividad de la Comunidad de Madrid por ciclo (kg/m2) en 2018 de Ministerio de Agricultura, Pesca y Alimentación. "]
[]
[null,null,null,null,null,null,null,"Fuente:  https://sede.agenciatributaria.gob.es/static_files/Sede/Tema/IVA/Novedades/Empresas/2023/Tipos_IVA%20_2023.pdf"]
[]
[]
[null,null,null,null,null,null,null,"TIPOS DE PRODUCTOS O SERVICIOS ","IVA % "]
[]
[null,null,null,null,null,null,null,"GASTOS DE ESTABLECIMIENTO","IVA % "]
[null,null,null,null,null,null,null,"Licencia Actividad",0]
[null,null,null,null,null,null,null,"Permisos",0.21]
[null,null,null,null,null,null,null,"Gastos Constitución",0.21]
[null,null,null,null,null,null,null,"Obras y reformas",0.21]
[null,null,null,null,null,null,null,"Fianza o Aval Alquiler Local",0]
[]
[]
[]
[null,null,null,null,null,null,null,"ACTIVO NO CORRIENTE","IVA % "]
[null,null,null,null,null,null,null,"Terrenos y bienes naturales",0.21]
[null,null,null,null,null,null,null,"Construcciones",0.21]
[null,null,null,null,null,null,null,"Maquinaria",0.21]
[null,null,null,null,null,null,null,"Utillaje y herramienta",0.21]
[null,null,null,null,null,null,null,"Otras instalaciones",0.21]
[null,null,null,null,null,null,null,"Mobiliario",0.21]
[null,null,null,null,null,null,null,"Equipos para proceso de información",0.21]
[null,null,null,null,null,null,null,"Elementos de transporte",0.21]
[null,null,null,null,null,null,null,"Gastos de inv.y des., pro. intelectual y derechos de traspaso",0.21]
[null,null,null,null,null,null,null,"Instalacion riego ",0.21]
[null,null,null,null,null,null,null,"Aplicaciones informáticas",0.21]
[]
[]
[]
[null,null,null,null,null,null,null,"ACTIVO CORRIENTE","IVA % "]
[null,null,null,null,null,null,null,"Stock Inicial de material para la venta",0.21]
[null,null,null,null,null,null,null,"mantenimiento riego ",0.21]
[null,null,null,null,null,null,null,"plantel ",0.1]
[null,null,null,null,null,null,null,"fitosanitarios ",0.1]
[null,null,null,null,null,null,null,"fertilizantes ",0.21]
[null,null,null,null,null,null,null,"Tesorería",0]
[]
[]
[]
[]
[null,null,null,null,null,null,null,"Relacionado con Gastos mensuales fijos"]
[]
[null,null,null,null,null,null,null,"TIPOS DE GASTOS FIJOS ","IVA APLICABLE "]
[null,null,null,null,null,null,null,"Alquileres y cánones",0.21]
[null,null,null,null,null,null,null,"Renting",0.21]
[null,null,null,null,null,null,null,"Conservación (Mantenimiento y reparaciones)",0.21]
[null,null,null,null,null,null,null,"Servicios profesionales",0.21]
[null,null,null,null,null,null,null,"Transporte",0.21]
[null,null,null,null,null,null,null,"Seguros",0]
[null,null,null,null,null,null,null,"Gastos bancarios",0.21]
[null,null,null,null,null,null,null,"Publicidad y comunicación",0.21]
[null,null,null,null,null,null,null,"Material de Oficina",0.21]
[null,null,null,null,null,null,null,"Sueldo bruto de los trabajadores autónomos",0]
[null,null,null,null,null,null,null,"Cotización a la Seguridad Social de los trabajadores autónomos",0]
[null,null,null,null,null,null,null,"Sueldo bruto de los trabajadores en régimen general",0]
[null,null,null,null,null,null,null,"Cotización a la Seguridad Social de los trabajadores en régimen general",0]
[null,null,null,null,null,null,null,"Retenciones IRPF",0]
[null,null,null,null,null,null,null,"Electricidad",0.1]
[null,null,null,null,null,null,null,"Consumo de agua",0.1]
[null,null,null,null,null,null,null,"Telefonia Movil / Fija",0.21]
[null,null,null,null,null,null,null,"Internet",0.21]
[null,null,null,null,null,null,null,"fitosanitarios ",0.1]
[null,null,null,null,null,null,null,"fertilizantes ",0.21]
[null,null,null,null,null,null,null,"Amortizaciones",0.21]
[null,null,null,null,null,null,null,"Mantenimiento del riego ",0.21]
[null,null,null,null,null,null,null,"Plantel ",0.1]
[]
[null,null,null,null,null,null,null,"Fuente:  https://sede.agenciatributaria.gob.es/static_files/Sede/Tema/IVA/Novedades/Empresas/2023/Tipos_IVA%20_2023.pdf"]